program: Orca
programVersion: 5.0.2
elementType: O O O O O O O O O N N C C C C C C C C C C C C C C C C C C C C C C H H H H H H H H H H H H H H H H H H H H H H H
charge: -1
multiplicity: 1
keywords: wb97x-d3
keywords: def2-TZVPP
keywords: def2/J RIJCOSX
keywords: DEFGRID2
keywords: scfconv7
keywords: smallprint printgap noloewdin
keywords: NOSOSCF
formula: C22H23N2O9
InChI: InChI=1/C22H23N2O9/c1-21(32)7-5-4-6-8(25)9(7)15(26)10-12(21)17(28)13-14(24(2)3)16(27)11(20(23)31)19(30)22(13,33)18(10)29/h4-6,12-14,17,23,25-26,28,30,32-33H,1-3H3
56 atoms
O  -0.070957 2.419074 2.230345
O  -1.085181 -0.313887 2.610764
O  1.759776 1.585653 -1.336253
O  -0.516034 -2.343928 0.150433
O  -3.00119 -2.000729 1.853711
O  1.844499 -2.534244 -0.50613
O  -3.868042 0.687477 -1.891301
O  4.424301 -2.936218 -0.401579
O  -4.771896 -2.102404 -1.494784
N  -1.676942 2.357074 -1.37202
N  -5.633704 -1.724038 0.57447
C  -1.381495 1.040421 0.704033
C  1.225605 0.868833 0.860153
C  -0.0481 1.750146 0.982823
C  -1.384956 -0.386275 1.235872
C  -1.777925 1.042665 -0.787129
C  2.298963 1.530641 -0.023743
C  0.971898 -0.53785 0.384227
C  -0.285233 -1.17928 0.531125
C  -2.717666 -1.042367 0.980065
C  3.540943 0.636145 -0.061119
C  -3.129521 0.349198 -0.976767
C  2.015954 -1.285208 -0.110614
C  -3.507895 -0.717921 -0.06833
C  2.635002 2.930542 0.476765
C  3.365679 -0.758816 -0.178036
C  4.817862 1.161927 -0.084521
C  -1.450203 2.399669 -2.798832
C  -2.624781 3.349151 -0.918717
C  4.489673 -1.599018 -0.305922
C  -4.736014 -1.554219 -0.363398
C  5.922584 0.321189 -0.203509
C  5.768137 -1.042174 -0.313116
H  -2.151699 1.589657 1.256169
H  1.662348 0.8089 1.865233
H  0.002194 2.547178 0.244085
H  -1.061781 0.410205 -1.331294
H  1.750894 3.564267 0.5101
H  3.341822 3.427824 -0.188246
H  3.071576 2.907104 1.474803
H  -0.138492 1.755725 2.92643
H  2.377646 2.068245 -1.898172
H  4.984573 2.225607 -0.007988
H  -2.349459 2.265222 -3.410936
H  -1.016981 3.364967 -3.072038
H  -0.734104 1.630449 -3.089296
H  -2.26883 4.342305 -1.200218
H  -3.634945 3.239658 -1.33184
H  -2.709101 3.343118 0.168336
H  -3.889092 -2.361833 1.655845
H  6.917589 0.746259 -0.212516
H  6.627544 -1.693717 -0.404402
H  -5.454884 -1.084803 1.342893
H  3.498516 -3.22681 -0.442419
H  0.870963 -2.76356 -0.345311
H  -0.94535 -1.19729 2.975343
elementType: O N C H
totalener: -1639.05759765 hartree
nucrepener: 3784.34162321 hartree
electener: -5423.39922087 hartree
oneelecener: -9796.39311104 hartree
twoeener: 4372.99389017 hartree
cpcmener: -0.18862899 hartree
kineticenergy: 1632.24750345 hartree
xcener: -152.418819940858 hartree
chargesum: -1.0000000
charge: -0.466546 -0.408116 -0.411647 -0.487466 -0.342115 -0.367762 -0.494654 -0.373776 -0.675212 -0.218991 -0.515936 0.135790 0.113081 0.018443 0.658127 -0.072923 0.567429 -0.377936 0.089584 0.144490 -0.194802 0.201893 0.263296 -0.149839 -0.394464 -0.101214 -0.162509 -0.203742 -0.209594 0.242006 0.131925 -0.112956 -0.215532 0.101065 0.099584 0.089803 0.125574 0.111981 0.108212 0.118117 0.231592 0.218821 0.150516 0.084557 0.105627 0.093227 0.106656 0.088220 0.104230 0.242305 0.159938 0.141815 0.156438 0.258904 0.259914 0.234570
qa: -0.4665 -0.4081 -0.4116 -0.4875 -0.3421 -0.3678 -0.4947 -0.3738 -0.6752 -0.2190 -0.5159 0.1358 0.1131 0.0184 0.6581 -0.0729 0.5674 -0.3779 0.0896 0.1445 -0.1948 0.2019 0.2633 -0.1498 -0.3945 -0.1012 -0.1625 -0.2037 -0.2096 0.2420 0.1319 -0.1130 -0.2155 0.1011 0.0996 0.0898 0.1256 0.1120 0.1082 0.1181 0.2316 0.2188 0.1505 0.0846 0.1056 0.0932 0.1067 0.0882 0.1042 0.2423 0.1599 0.1418 0.1564 0.2589 0.2599 0.2346
va: 1.9398 2.0613 2.0173 2.0402 2.1833 2.1663 1.9940 2.1319 1.7736 2.8409 2.8266 3.7740 3.6649 3.9896 3.7717 3.9550 3.7045 3.6056 4.1585 3.9761 3.8741 4.1406 3.9313 3.2587 3.9987 3.6141 3.8683 3.9321 3.9232 3.9399 4.6158 3.9605 3.9568 1.0398 1.0280 1.0776 0.9910 1.0030 1.0013 1.0003 1.0178 1.0104 1.0021 1.0080 0.9902 1.0018 0.9928 1.0093 0.9995 1.0530 0.9893 1.0100 0.9968 1.0296 1.0790 1.0095
dispersion: -0.038277946 hartree
energy: -1639.095875599560 hartree
dipole: 8.55834 3.14045 11.69879 25.89615 -21.73855 4.15761 -2.02765 5.19602 3.16837
magnitude: 12.81350 au
magnitude: 32.56934 debye
