program: Orca
programVersion: 5.0.2
elementType: O O O O O O O O O N N C C C C C C C C C C C C C C C C C C C C C C H H H H H H H H H H H H H H H H H H H H H H H
charge: -1
multiplicity: 1
keywords: wb97x-d3
keywords: def2-TZVPP
keywords: def2/J RIJCOSX
keywords: DEFGRID2
keywords: scfconv7
keywords: smallprint printgap noloewdin
keywords: NOSOSCF
formula: C22H23N2O9
InChI: InChI=1/C22H23N2O9/c1-21(32)7-5-4-6-8(25)9(7)15(26)10-12(21)17(28)13-14(24(2)3)16(27)11(20(23)31)19(30)22(13,33)18(10)29/h4-6,12-14,17,25-26,28,32-33H,23H2,1-3H3
56 atoms
O  0.058801 -2.200871 -2.499692
O  -1.040892 0.521052 -2.653957
O  1.93693 -1.701757 1.07818
O  -0.532534 2.349583 -0.134728
O  -3.220205 1.527519 -2.059254
O  1.71493 2.565798 0.630467
O  -3.018137 -0.282395 2.320711
O  4.225743 3.059434 0.847169
O  -5.442828 1.752884 -0.359335
N  -1.790527 -2.476597 1.068023
N  -4.986298 1.41957 1.818037
C  -1.262036 -1.041535 -0.823732
C  1.31084 -0.750738 -0.996865
C  0.077614 -1.688949 -1.183321
C  -1.348093 0.392312 -1.289604
C  -1.565551 -1.093589 0.672637
C  2.447848 -1.426078 -0.214735
C  0.991163 0.595319 -0.406322
C  -0.301209 1.201983 -0.552766
C  -2.7780 0.92894 -1.079669
C  3.623076 -0.459846 -0.041492
C  -2.710713 -0.157966 1.125901
C  1.970682 1.350402 0.172493
C  -3.377744 0.681855 0.181255
C  2.874202 -2.718301 -0.910673
C  3.34936 0.887189 0.254406
C  4.935266 -0.900467 -0.040457
C  -3.103453 -2.999455 0.780399
C  -1.343935 -2.839304 2.389435
C  4.4037 1.769561 0.558534
C  -4.681853 1.323198 0.490497
C  5.972857 -0.019738 0.250629
C  5.717445 1.298009 0.554332
H  -2.034563 -1.609951 -1.353505
H  1.705739 -0.576338 -2.00659
H  0.172302 -2.555405 -0.526581
H  -0.673328 -0.76363 1.217821
H  3.30234 -2.520556 -1.893106
H  2.024566 -3.382048 -1.048619
H  3.61407 -3.267804 -0.324865
H  -0.256379 -1.48248 -3.061422
H  2.647806 -2.059641 1.616562
H  5.173886 -1.927208 -0.275536
H  -3.878907 -2.660685 1.480066
H  -3.423074 -2.717786 -0.223425
H  -3.074502 -4.092121 0.815186
H  -1.98998 -2.476663 3.196783
H  -1.288034 -3.930431 2.463102
H  -0.339082 -2.450635 2.5538
H  -1.810799 1.066042 -2.956608
H  6.995238 -0.376068 0.242464
H  6.518462 1.987187 0.786973
H  -4.441094 0.863681 2.464421
H  -5.937715 1.65577 2.035182
H  3.267685 3.245464 0.855236
H  0.695217 2.722574 0.398247
totalener: -1638.99989606 hartree
nucrepener: 3793.50703379 hartree
electener: -5432.50692985 hartree
oneelecener: -9816.43393540 hartree
twoeener: 4383.92700555 hartree
kineticenergy: 1632.44838914 hartree
xcener: -152.451806418108 hartree
chargesum: -1.0000000
charge: -0.391307 -0.451836 -0.307787 -0.359232 -0.410844 -0.408542 -0.503292 -0.327605 -0.407795 -0.212311 -0.293367 0.112558 0.095303 0.019902 0.566107 -0.020696 0.466643 -0.401412 0.110168 0.193998 -0.180057 0.170912 0.257169 -0.196955 -0.341815 -0.074366 -0.159035 -0.202479 -0.175110 0.216453 0.208338 -0.096371 -0.191746 0.067295 0.074143 0.070686 0.095664 0.098752 0.115442 0.066959 0.189860 0.152486 0.114882 0.085579 0.092055 0.076325 0.093396 0.065809 0.067765 0.205427 0.111474 0.106570 0.169828 0.114348 0.221735 0.239930
qa: -0.3913 -0.4518 -0.3078 -0.3592 -0.4108 -0.4085 -0.5033 -0.3276 -0.4078 -0.2123 -0.2934 0.1126 0.0953 0.0199 0.5661 -0.0207 0.4666 -0.4014 0.1102 0.1940 -0.1801 0.1709 0.2572 -0.1970 -0.3418 -0.0744 -0.1590 -0.2025 -0.1751 0.2165 0.2083 -0.0964 -0.1917 0.0673 0.0741 0.0707 0.0957 0.0988 0.1154 0.0670 0.1899 0.1525 0.1149 0.0856 0.0921 0.0763 0.0934 0.0658 0.0678 0.2054 0.1115 0.1066 0.1698 0.1143 0.2217 0.2399
va: 2.0262 2.0360 2.1084 2.1831 2.1225 2.1097 2.0144 2.1892 2.1237 2.9212 3.0755 3.8657 3.7009 4.0733 3.8085 3.9217 3.8884 3.5484 3.9679 4.0657 3.9042 4.0449 3.9271 3.1804 3.9871 3.6278 3.9079 3.9610 3.9406 4.0207 4.4293 4.0085 3.9954 1.0622 1.0393 1.0678 1.0127 1.0068 1.0144 1.0034 1.0686 1.0648 1.0123 1.0084 0.9997 0.9927 1.0125 0.9894 1.0145 1.1042 1.0017 1.0199 1.0810 1.0526 1.0845 1.1222
dispersion: -0.037830246 hartree
energy: -1639.037726302637 hartree
dipole: 5.96901 -0.75285 5.21616 -26.03644 23.87210 -2.16434 6.01456 -5.25697 0.75759
magnitude: 5.69795 au
magnitude: 14.48304 debye
