program: Orca
programVersion: 5.0.2
elementType: O O O O O O O O O N N C C C C C C C C C C C C C C C C C C C C C C H H H H H H H H H H H H H H H H H H H H H H H
charge: -1
multiplicity: 1
keywords: wb97x-d3
keywords: def2-TZVPP
keywords: def2/J RIJCOSX
keywords: DEFGRID2
keywords: scfconv7
keywords: smallprint printgap noloewdin
keywords: NOSOSCF
formula: C22H23N2O9
InChI: InChI=1/C22H23N2O9/c1-21(32)7-5-4-6-8(25)9(7)15(26)10-12(21)17(28)13-14(24(2)3)16(27)11(20(23)31)19(30)22(13,33)18(10)29/h4-6,12-14,17,25-26,28,32-33H,23H2,1-3H3
56 atoms
O  0.084701 -2.254892 -2.506825
O  -1.060363 0.465189 -2.689762
O  1.990617 -1.816923 1.079196
O  -0.60693 2.332846 -0.196802
O  -3.282923 1.487715 -2.041561
O  1.689927 2.593307 0.561924
O  -2.876302 -0.216624 2.350279
O  4.210559 3.110269 0.788566
O  -5.39511 1.790422 -0.277317
N  -1.850878 -2.518677 1.023741
N  -4.8989 1.429635 1.877671
C  -1.268214 -1.08183 -0.856027
C  1.305699 -0.75122 -1.017301
C  0.088906 -1.704252 -1.20475
C  -1.370635 0.35153 -1.324112
C  -1.557826 -1.144982 0.644296
C  2.43812 -1.422178 -0.208468
C  0.961734 0.599146 -0.438532
C  -0.332532 1.184587 -0.591035
C  -2.791278 0.881255 -1.085787
C  3.600681 -0.442669 -0.01186
C  -2.640268 -0.164192 1.132897
C  1.947895 1.375171 0.121071
C  -3.35078 0.65789 0.201438
C  2.891159 -2.698894 -0.904839
C  3.322365 0.919122 0.231333
C  4.907817 -0.887491 0.056492
C  -3.194038 -2.970468 0.742974
C  -1.406645 -2.93281 2.333353
C  4.37474 1.80583 0.546687
C  -4.619569 1.32761 0.561602
C  5.938744 -0.002168 0.356393
C  5.682746 1.328001 0.603731
H  -2.033818 -1.662269 -1.382316
H  1.719654 -0.575352 -2.019123
H  0.200731 -2.55946 -0.536711
H  -0.648203 -0.862381 1.185552
H  3.633617 -3.236972 -0.316763
H  3.321976 -2.482128 -1.881598
H  2.059784 -3.386061 -1.051468
H  -0.127788 -1.5463 -3.12608
H  1.645446 -1.049837 1.55161
H  5.153384 -1.923859 -0.120006
H  -3.505613 -2.685574 -0.262802
H  -3.228115 -4.06128 0.789631
H  -3.951475 -2.592899 1.44441
H  -2.032347 -2.582904 3.163427
H  -1.389875 -4.024866 2.380343
H  -0.387864 -2.587898 2.511526
H  -1.778497 1.023158 -3.049808
H  6.957581 -0.36501 0.401825
H  6.484637 2.014906 0.843102
H  -4.319016 0.94133 2.545373
H  -5.808403 1.764138 2.150349
H  3.264886 3.338294 0.770774
H  0.704884 2.775458 0.352638
elementType: O N C H
totalener: -1639.09675826 hartree
nucrepener: 3792.75195696 hartree
electener: -5431.84871522 hartree
oneelecener: -9815.34136304 hartree
twoeener: 4383.49264782 hartree
cpcmener: -0.12063645 hartree
kineticenergy: 1632.35575150 hartree
xcener: -152.453273296124 hartree
chargesum: -1.0000000
charge: -0.449107 -0.449564 -0.413390 -0.453866 -0.507040 -0.377700 -0.552000 -0.360778 -0.544149 -0.232716 -0.292357 0.131013 0.038978 0.034899 0.605064 -0.020145 0.587356 -0.432888 0.116445 0.181969 -0.176354 0.190463 0.282327 -0.242603 -0.396678 -0.057890 -0.188957 -0.212070 -0.194985 0.229488 0.258509 -0.111684 -0.219880 0.076893 0.089483 0.076461 0.118495 0.102391 0.117124 0.108211 0.222290 0.227256 0.147284 0.103809 0.105285 0.080744 0.081198 0.098605 0.087793 0.223212 0.155247 0.137125 0.202606 0.163990 0.250335 0.254453
qa: -0.4491 -0.4496 -0.4134 -0.4539 -0.5070 -0.3777 -0.5520 -0.3608 -0.5441 -0.2327 -0.2924 0.1310 0.0390 0.0349 0.6051 -0.0201 0.5874 -0.4329 0.1164 0.1820 -0.1764 0.1905 0.2823 -0.2426 -0.3967 -0.0579 -0.1890 -0.2121 -0.1950 0.2295 0.2585 -0.1117 -0.2199 0.0769 0.0895 0.0765 0.1185 0.1024 0.1171 0.1082 0.2223 0.2273 0.1473 0.1038 0.1053 0.0807 0.0812 0.0986 0.0878 0.2232 0.1552 0.1371 0.2026 0.1640 0.2503 0.2545
va: 1.9678 2.0285 2.0189 2.0761 1.9968 2.1461 1.9526 2.1491 1.9611 2.8940 3.1324 3.7653 3.7229 3.9934 3.6848 3.9034 3.6981 3.5196 3.9976 4.0690 3.8851 4.0551 3.8871 3.1131 3.9692 3.5424 3.9102 3.9484 3.9359 3.9676 4.4224 3.9612 3.9615 1.0653 1.0330 1.0731 1.0192 1.0107 1.0000 1.0116 1.0313 1.0110 1.0019 0.9944 0.9945 1.0032 1.0089 0.9912 1.0064 1.0644 0.9905 1.0121 1.0517 1.0237 1.0435 1.0900
dispersion: -0.038187045 hartree
energy: -1639.134945303510 hartree
dipole: 5.13136 1.50493 6.63629 -25.00764 22.76778 -2.23986 5.98130 -4.81726 1.16404
magnitude: 7.10016 au
magnitude: 18.04718 debye
