program: Orca
programVersion: 5.0.2
elementType: O O O O O O O O O N N C C C C C C C C C C C C C C C C C C C C C C H H H H H H H H H H H H H H H H H H H H H H H
charge: -1
multiplicity: 1
keywords: wb97x-d3
keywords: def2-TZVPP
keywords: def2/J RIJCOSX
keywords: DEFGRID2
keywords: scfconv7
keywords: smallprint printgap noloewdin
keywords: NOSOSCF
formula: C22H23N2O9
InChI: InChI=1/C22H23N2O9/c1-21(32)7-5-4-6-8(25)9(7)15(26)10-12(21)17(28)13-14(24(2)3)16(27)11(20(23)31)19(30)22(13,33)18(10)29/h4-6,12-14,17,25-26,28,32-33H,23H2,1-3H3
56 atoms
O  0.133365 -2.283531 -2.434345
O  -1.000567 0.494317 -2.635706
O  1.974668 -1.626372 1.144064
O  -0.599142 2.317325 -0.075237
O  -3.228084 1.534111 -2.003102
O  1.71865 2.583172 0.658088
O  -2.883313 -0.218068 2.368784
O  4.252011 3.147028 0.713804
O  -5.383311 1.771752 -0.300326
N  -1.909145 -2.543326 1.004238
N  -4.960245 1.350338 1.858044
C  -1.247339 -1.076128 -0.826697
C  1.32994 -0.740884 -0.964995
C  0.117627 -1.69974 -1.144515
C  -1.335599 0.36501 -1.274647
C  -1.568947 -1.166098 0.665397
C  2.471503 -1.396613 -0.167432
C  0.985041 0.603778 -0.373411
C  -0.308945 1.182721 -0.506616
C  -2.756416 0.896362 -1.05319
C  3.640353 -0.416489 -0.045668
C  -2.639622 -0.174874 1.151401
C  1.97699 1.376861 0.181694
C  -3.344496 0.648441 0.215149
C  2.899294 -2.710348 -0.812112
C  3.359913 0.939921 0.223584
C  4.953187 -0.844606 -0.073784
C  -3.271784 -2.927982 0.70524
C  -1.508173 -2.983415 2.322131
C  4.418452 1.839093 0.46287
C  -4.627743 1.293281 0.556426
C  5.991568 0.05525 0.155916
C  5.734676 1.380259 0.426018
H  -2.002332 -1.645252 -1.379472
H  1.735202 -0.563093 -1.969833
H  0.225865 -2.539309 -0.457892
H  -0.664049 -0.919295 1.230884
H  3.301419 -2.556239 -1.812987
H  2.063511 -3.403298 -0.886194
H  3.661747 -3.213909 -0.21703
H  -0.021265 -1.583715 -3.079398
H  2.635725 -2.130675 1.633303
H  5.199571 -1.876554 -0.2729
H  -4.017105 -2.523419 1.403501
H  -3.556669 -2.618294 -0.300823
H  -3.357598 -4.015531 0.740391
H  -2.138981 -2.617782 3.140897
H  -1.53401 -4.074813 2.361774
H  -0.481946 -2.675762 2.522987
H  -1.69165 1.080036 -2.999639
H  7.015595 -0.292998 0.126666
H  6.542073 2.077617 0.608342
H  -4.382733 0.879572 2.539316
H  -5.877826 1.679696 2.109221
H  3.304418 3.359007 0.762549
H  0.732806 2.761638 0.478332
elementType: O N C H
totalener: -1639.10706935 hartree
nucrepener: 3789.37915941 hartree
electener: -5428.48622876 hartree
oneelecener: -9810.37506517 hartree
twoeener: 4381.88883641 hartree
cpcmener: -0.15250895 hartree
kineticenergy: 1632.34171673 hartree
xcener: -152.455897047053 hartree
chargesum: -1.0000000
charge: -0.466271 -0.455598 -0.412603 -0.489372 -0.547371 -0.373207 -0.571387 -0.377015 -0.595312 -0.238404 -0.284916 0.119680 0.087853 0.027210 0.632766 0.000584 0.560934 -0.414519 0.118742 0.196714 -0.191688 0.211831 0.261560 -0.253659 -0.391150 -0.097074 -0.163121 -0.216360 -0.194860 0.244806 0.290517 -0.114677 -0.217012 0.076078 0.100927 0.079708 0.119244 0.117515 0.111005 0.107157 0.229755 0.221498 0.149854 0.081067 0.106008 0.109951 0.079472 0.102123 0.090615 0.228843 0.160076 0.141474 0.209251 0.171858 0.258604 0.260294
qa: -0.4663 -0.4556 -0.4126 -0.4894 -0.5474 -0.3732 -0.5714 -0.3770 -0.5953 -0.2384 -0.2849 0.1197 0.0879 0.0272 0.6328 0.0006 0.5609 -0.4145 0.1187 0.1967 -0.1917 0.2118 0.2616 -0.2537 -0.3911 -0.0971 -0.1631 -0.2164 -0.1949 0.2448 0.2905 -0.1147 -0.2170 0.0761 0.1009 0.0797 0.1192 0.1175 0.1110 0.1072 0.2298 0.2215 0.1499 0.0811 0.1060 0.1100 0.0795 0.1021 0.0906 0.2288 0.1601 0.1415 0.2093 0.1719 0.2586 0.2603
va: 1.9442 2.0193 2.0204 2.0304 1.9423 2.1541 1.9228 2.1289 1.8924 2.8915 3.1613 3.8224 3.6684 3.9657 3.6275 3.8778 3.7161 3.5563 3.9855 4.0374 3.8768 4.0218 3.9399 3.1522 3.9878 3.6072 3.8669 3.9486 3.9310 3.9361 4.3829 3.9589 3.9567 1.0676 1.0266 1.0700 1.0215 1.0005 1.0054 1.0021 1.0209 1.0087 1.0023 1.0031 0.9928 0.9951 1.0091 0.9912 1.0081 1.0552 0.9893 1.0103 1.0452 1.0194 1.0331 1.0799
dispersion: -0.037810869 hartree
energy: -1639.144880219080 hartree
dipole: 5.51921 2.36469 7.88390 -26.19777 22.65418 -3.54359 5.71665 -4.38884 1.32780
magnitude: 8.74505 au
magnitude: 22.22816 debye
