program: Orca
programVersion: 5.0.2
elementType: O O O O O O O O O N N C C C C C C C C C C C C C C C C C C C C C C H H H H H H H H H H H H H H H H H H H H H H H
charge: -1
multiplicity: 1
keywords: wb97x-d3
keywords: def2-TZVPP
keywords: def2/J RIJCOSX
keywords: DEFGRID2
keywords: scfconv7
keywords: smallprint printgap noloewdin
keywords: NOSOSCF
formula: C22H23N2O9
InChI: InChI=1/C22H23N2O9/c1-21(32)7-5-4-6-8(25)9(7)15(26)10-12(21)17(28)13-14(24(2)3)16(27)11(20(23)31)19(30)22(13,33)18(10)29/h4-6,12-14,17,25-26,28,32-33H,23H2,1-3H3
56 atoms
O  0.105567 -2.262684 -2.505462
O  -1.054277 0.465269 -2.689273
O  1.997161 -1.8040 1.091036
O  -0.616628 2.323094 -0.176737
O  -3.282521 1.487152 -2.027175
O  1.690452 2.593909 0.575164
O  -2.819129 -0.190491 2.36234
O  4.215612 3.125446 0.768577
O  -5.390775 1.758485 -0.268327
N  -1.877075 -2.536109 1.006332
N  -4.90227 1.380337 1.884695
C  -1.25899 -1.090137 -0.860082
C  1.314787 -0.748742 -1.01327
C  0.10291 -1.705221 -1.204299
C  -1.364166 0.345694 -1.321604
C  -1.548391 -1.163583 0.63993
C  2.445923 -1.417192 -0.200503
C  0.964574 0.599776 -0.432396
C  -0.330204 1.178259 -0.580279
C  -2.783585 0.870665 -1.07758
C  3.606934 -0.435636 -0.012658
C  -2.60797 -0.165971 1.138343
C  1.951331 1.377815 0.127898
C  -3.338698 0.641652 0.208884
C  2.899756 -2.696908 -0.890106
C  3.326911 0.926477 0.228937
C  4.915157 -0.877296 0.044717
C  -3.242831 -2.931002 0.73579
C  -1.457204 -2.95091 2.326786
C  4.3809 1.815288 0.530512
C  -4.610769 1.295176 0.574699
C  5.947259 0.011463 0.330942
C  5.690374 1.341903 0.575912
H  -2.021782 -1.67006 -1.390436
H  1.734202 -0.570664 -2.012251
H  0.219881 -2.557171 -0.534676
H  -0.633112 -0.908246 1.184046
H  3.64994 -3.225849 -0.304302
H  3.322616 -2.483709 -1.870725
H  2.070833 -3.38922 -1.024057
H  -0.057574 -1.549082 -3.133177
H  1.629019 -1.03807 1.548902
H  5.161715 -1.913229 -0.131195
H  -3.546328 -2.637903 -0.269712
H  -3.323228 -4.018232 0.789109
H  -3.977535 -2.518637 1.440755
H  -2.084084 -2.579465 3.145547
H  -1.469823 -4.041674 2.384022
H  -0.432919 -2.628443 2.512854
H  -1.760049 1.036304 -3.048501
H  6.966839 -0.348881 0.367625
H  6.493139 2.030756 0.804813
H  -4.307304 0.916099 2.555451
H  -5.812813 1.712202 2.157215
H  3.269411 3.349182 0.762409
H  0.707775 2.773592 0.376306
elementType: O N C H
totalener: -1639.10744300 hartree
nucrepener: 3793.22337966 hartree
electener: -5432.33082266 hartree
oneelecener: -9816.43924116 hartree
twoeener: 4384.10841849 hartree
cpcmener: -0.14779381 hartree
kineticenergy: 1632.33715135 hartree
xcener: -152.455331136372 hartree
chargesum: -1.0000000
charge: -0.467676 -0.456113 -0.435827 -0.484133 -0.546496 -0.371081 -0.571977 -0.375681 -0.595095 -0.235129 -0.285095 0.125661 0.030473 0.038758 0.618720 -0.022365 0.604632 -0.422119 0.121077 0.197518 -0.180758 0.213956 0.283511 -0.254742 -0.400722 -0.055786 -0.188188 -0.215845 -0.196974 0.235613 0.290919 -0.111204 -0.222274 0.078744 0.095346 0.078347 0.128333 0.105417 0.120600 0.108459 0.230500 0.237757 0.151291 0.105927 0.110090 0.081474 0.079770 0.102612 0.091570 0.228969 0.160316 0.141335 0.209118 0.171956 0.257711 0.258798
qa: -0.4677 -0.4561 -0.4358 -0.4841 -0.5465 -0.3711 -0.5720 -0.3757 -0.5951 -0.2351 -0.2851 0.1257 0.0305 0.0388 0.6187 -0.0224 0.6046 -0.4221 0.1211 0.1975 -0.1808 0.2140 0.2835 -0.2547 -0.4007 -0.0558 -0.1882 -0.2158 -0.1970 0.2356 0.2909 -0.1112 -0.2223 0.0787 0.0953 0.0783 0.1283 0.1054 0.1206 0.1085 0.2305 0.2378 0.1513 0.1059 0.1101 0.0815 0.0798 0.1026 0.0916 0.2290 0.1603 0.1413 0.2091 0.1720 0.2577 0.2588
va: 1.9445 2.0155 1.9940 2.0370 1.9435 2.1536 1.9210 2.1300 1.8928 2.8950 3.1614 3.7796 3.7315 3.9692 3.6498 3.9022 3.6544 3.5387 3.9957 4.0371 3.8745 4.0188 3.8971 3.1558 3.9750 3.5520 3.9043 3.9485 3.9348 3.9477 4.3820 3.9574 3.9618 1.0656 1.0297 1.0735 1.0174 1.0102 0.9991 1.0105 1.0217 1.0027 1.0005 0.9932 0.9950 1.0027 1.0090 0.9913 1.0056 1.0554 0.9890 1.0107 1.0455 1.0192 1.0349 1.0815
dispersion: -0.038229790 hartree
energy: -1639.145672788821 hartree
dipole: 4.91860 2.12072 7.03932 -24.90436 22.50612 -2.39824 5.92243 -4.60126 1.32117
magnitude: 7.55308 au
magnitude: 19.19841 debye
