program: Orca
programVersion: 5.0.2
elementType: O O O O O O O O O O O O N N N N N N N C C C C C C C C C C C C C C C C C C C C C H H H H H H H H H H H H H H H H H H H H H H H H H H H H H H H H H H H H H H H H
charge: 1
multiplicity: 1
keywords: wb97x-d3
keywords: def2-TZVPP
keywords: def2/J RIJCOSX
keywords: DEFGRID2
keywords: scfconv7
keywords: smallprint printgap noloewdin
keywords: NOSOSCF
formula: C21H40N7O12
InChI: InChI=1/C21H40N7O12/c1-5-21(36,4-30)16(40-17-9(26-2)13(34)10(31)6(3-29)38-17)18(37-5)39-15-8(28-20(24)25)11(32)7(27-19(22)23)12(33)14(15)35/h4-18,26,28-29,31-36H,3,22-25H2,1-2H3
80 atoms
O  0.460709 0.667836 -0.499108
O  -0.744094 1.461061 -2.307779
O  -2.787012 0.15042 -0.041884
O  -3.142413 0.424691 2.234526
O  -3.593545 2.058794 -1.77798
O  1.155418 -0.277771 -3.280461
O  4.693923 -0.86799 0.92527
O  3.832653 -0.595683 -3.777855
O  -4.882804 -3.203335 1.353843
O  -2.498245 -3.055865 2.994185
O  -2.078084 4.023052 0.65281
O  -0.826699 -1.290705 4.406487
N  1.989482 -0.408577 1.526704
N  5.513285 -1.50587 -1.588965
N  -5.383925 -1.039732 -0.355907
N  3.313913 1.087614 2.691219
N  1.647897 -0.066141 3.770047
N  6.648671 0.076909 -2.939368
N  7.622539 -1.927303 -2.353412
C  -1.863008 1.175472 -0.261904
C  1.471188 -0.257027 -0.858347
C  -2.449627 2.383134 -1.047697
C  -0.753851 0.62415 -1.181297
C  2.550574 -0.118457 0.21893
C  2.072982 0.001114 -2.247771
C  3.739544 -1.017793 -0.094002
C  -1.235443 2.743657 -1.927837
C  3.288243 -0.888832 -2.514598
C  4.354829 -0.668485 -1.45009
C  -3.735554 0.341282 0.970121
C  -4.704979 -0.841119 0.904604
C  -3.975623 -2.13098 1.287515
C  -3.313746 -1.954444 2.643445
C  -2.411335 -0.720512 2.638655
C  -1.530838 3.570816 -3.151463
C  -2.832193 3.5350 -0.148387
C  -1.856569 -0.40244 4.023468
C  2.324721 0.193368 2.664178
C  -6.427696 -0.07676 -0.65133
C  6.530071 -1.110939 -2.274135
H  -1.41112 1.528754 0.671553
H  1.062526 -1.279087 -0.840408
H  -0.980101 -0.39381 -1.515554
H  2.884125 0.924984 0.214139
H  2.401375 1.050117 -2.28594
H  3.388104 -2.060995 -0.13524
H  -0.489813 3.258557 -1.308503
H  2.967722 -1.942189 -2.472021
H  4.602525 0.407618 -1.432348
H  -4.271268 1.290227 0.846143
H  -5.472883 -0.650837 1.663895
H  -3.191687 -2.338331 0.542014
H  -4.102472 -1.801825 3.395451
H  -1.563654 -0.896089 1.959825
H  -0.615428 3.756217 -3.713881
H  -2.247826 3.0899 -3.8160
H  -1.935028 4.540078 -2.857057
H  -3.861596 3.910831 -0.282322
H  -3.407162 1.348093 -2.402986
H  0.585268 0.490843 -3.408432
H  -4.710787 -1.060712 -1.112558
H  5.506015 -1.266085 0.575516
H  3.135236 -0.695582 -4.436186
H  -1.423934 0.600797 4.012957
H  -2.66869 -0.398888 4.761385
H  -5.459232 -3.110217 0.582095
H  -3.059221 -3.796663 3.247512
H  -7.211199 -0.136488 0.10549
H  -6.883466 -0.322457 -1.610519
H  -6.095476 0.966387 -0.703042
H  -1.136391 -2.193807 4.248474
H  3.546788 1.521919 3.570801
H  4.075025 1.000143 2.034965
H  0.794412 -0.626549 3.794028
H  1.971519 0.303517 4.649971
H  5.796189 0.478391 -3.294137
H  7.411725 0.159037 -3.592987
H  8.507718 -1.516795 -2.604566
H  7.685957 -2.634664 -1.639904
H  1.302238 -1.147792 1.586065
elementType: O N C H
totalener: -2110.49096897 hartree
nucrepener: 5476.36863174 hartree
electener: -7586.85960071 hartree
twoeener: 6175.22798285 hartree
cpcmener: -0.13776068 hartree
kineticenergy: 2101.43106404 hartree
xcener: -194.566047631909 hartree
chargesum: 1.0000000
charge: -0.334760 -0.375444 -0.372959 -0.390365 -0.410339 -0.427832 -0.432236 -0.405016 -0.431005 -0.416096 -0.378706 -0.424197 -0.158032 -0.527599 -0.337680 -0.255213 -0.292393 -0.316061 -0.292469 0.053437 0.049410 0.324874 0.199660 0.025168 0.071848 0.140065 0.106741 0.131253 0.093895 0.252769 0.073504 0.086425 0.123386 0.105965 -0.298358 0.172041 0.038611 0.421558 -0.185170 0.320482 0.098032 0.100920 0.105932 0.117750 0.088218 0.087926 0.093010 0.092683 0.084855 0.132434 0.089013 0.080761 0.091747 0.049417 0.107181 0.086172 0.100169 0.117622 0.231136 0.244324 0.135455 0.230874 0.215456 0.095050 0.105186 0.231991 0.235728 0.096433 0.107202 0.079089 0.239170 0.186681 0.210951 0.230842 0.197806 0.189123 0.165825 0.171379 0.175646 0.171650
qa: -0.3348 -0.3754 -0.3730 -0.3904 -0.4103 -0.4278 -0.4322 -0.4050 -0.4310 -0.4161 -0.3787 -0.4242 -0.1580 -0.5276 -0.3377 -0.2552 -0.2924 -0.3161 -0.2925 0.0534 0.0494 0.3249 0.1997 0.0252 0.0718 0.1401 0.1067 0.1313 0.0939 0.2528 0.0735 0.0864 0.1234 0.1060 -0.2984 0.1720 0.0386 0.4216 -0.1852 0.3205 0.0980 0.1009 0.1059 0.1177 0.0882 0.0879 0.0930 0.0927 0.0849 0.1324 0.0890 0.0808 0.0917 0.0494 0.1072 0.0862 0.1002 0.1176 0.2311 0.2443 0.1355 0.2309 0.2155 0.0950 0.1052 0.2320 0.2357 0.0964 0.1072 0.0791 0.2392 0.1867 0.2110 0.2308 0.1978 0.1891 0.1658 0.1714 0.1756 0.1717
va: 2.0067 1.9613 2.0025 2.0276 2.0468 2.0045 2.0061 2.0207 2.0059 2.0237 2.0930 1.9904 3.2813 2.8864 2.9676 3.2813 3.2976 3.1539 3.1443 3.9650 3.9271 3.7337 4.0686 3.8596 4.0266 3.9950 3.9341 3.8779 3.8141 4.0130 3.8919 4.0218 3.8414 3.8577 3.9894 3.9803 3.8382 4.1975 3.9507 4.3336 1.0522 1.0223 1.0285 1.0321 1.0223 1.0338 1.0286 1.0270 1.0404 0.9790 1.0295 1.0356 1.0195 1.0420 1.0027 1.0162 1.0025 1.0058 1.0169 1.0274 1.0325 1.0370 1.0314 1.0064 0.9989 1.0356 1.0053 0.9948 0.9948 0.9933 1.0364 1.0074 1.0250 1.0539 1.0027 1.0325 1.0145 1.0110 1.0207 1.0193
dispersion: -0.052772599 hartree
energy: -2110.543741567163 hartree
dipole: -4.24297 7.33411 3.09114 0.83143 -0.18817 0.64326 -2.28597 3.61423 1.32826
magnitude: 3.42538 au
magnitude: 8.70662 debye
