program: Orca
programVersion: 5.0.2
elementType: O O O O O O O O O O O O N N N N N N N C C C C C C C C C C C C C C C C C C C C C H H H H H H H H H H H H H H H H H H H H H H H H H H H H H H H H H H H H H H H H
charge: 1
multiplicity: 1
keywords: wb97x-d3
keywords: def2-TZVPP
keywords: def2/J RIJCOSX
keywords: DEFGRID2
keywords: scfconv7
keywords: smallprint printgap noloewdin
keywords: NOSOSCF
formula: C21H40N7O12
InChI: InChI=1/C21H40N7O12/c1-5-21(36,4-30)16(40-17-9(26-2)13(34)10(31)6(3-29)38-17)18(37-5)39-15-8(28-20(24)25)11(32)7(27-19(22)23)12(33)14(15)35/h4-18,26,28-29,31-36H,3,22-25H2,1-2H3
80 atoms
O  0.466874 0.627255 -0.525783
O  -0.775588 1.310142 -2.358229
O  -2.787692 0.121287 -0.012596
O  -3.063975 0.343429 2.28268
O  -3.608979 1.967169 -1.806836
O  1.204366 -0.294918 -3.31182
O  4.708901 -0.880155 0.930296
O  3.91453 -0.479976 -3.776497
O  -5.073521 -3.133747 1.32629
O  -2.663061 -3.203132 2.921754
O  -2.013051 4.034296 0.489361
O  -0.842711 -1.589399 4.371736
N  1.979443 -0.489438 1.502209
N  5.59654 -1.339025 -1.618726
N  -5.463239 -0.862606 -0.303501
N  3.216456 1.038787 2.732796
N  1.67242 -0.303396 3.766469
N  6.66601 0.498814 -2.666773
N  7.819878 -1.42366 -2.165207
C  -1.857263 1.130039 -0.279868
C  1.492939 -0.284127 -0.883294
C  -2.445022 2.309723 -1.111082
C  -0.758906 0.535502 -1.185692
C  2.55389 -0.151096 0.213031
C  2.100706 0.009003 -2.264345
C  3.768952 -1.013107 -0.109449
C  -1.24686 2.615051 -2.03211
C  3.353708 -0.822937 -2.52891
C  4.38738 -0.58351 -1.439141
C  -3.696158 0.339599 1.031656
C  -4.744306 -0.771586 0.951046
C  -4.095536 -2.118509 1.272199
C  -3.397546 -2.030789 2.618711
C  -2.409298 -0.864775 2.639532
C  -1.559915 3.384155 -3.288371
C  -2.7948 3.508788 -0.263047
C  -1.827299 -0.633694 4.030723
C  2.300886 0.072827 2.663616
C  -6.437701 0.197063 -0.502629
C  6.618075 -0.76879 -2.160625
H  -1.397692 1.51593 0.636047
H  1.095341 -1.310016 -0.885469
H  -0.977249 -0.50095 -1.461761
H  2.864396 0.898542 0.237115
H  2.38616 1.070663 -2.287778
H  3.442289 -2.061239 -0.19404
H  -0.484637 3.151518 -1.45375
H  3.073986 -1.887981 -2.517318
H  4.56632 0.502335 -1.371166
H  -4.169091 1.325328 0.952528
H  -5.479679 -0.558184 1.735016
H  -3.345051 -2.354645 0.502653
H  -4.159279 -1.845494 3.389786
H  -1.580872 -1.072095 1.946531
H  -0.652153 3.541442 -3.870443
H  -2.286176 2.871652 -3.917879
H  -1.959597 4.365778 -3.032794
H  -3.824388 3.884776 -0.38448
H  -3.443127 1.213606 -2.386515
H  0.562106 0.424631 -3.382411
H  -4.798646 -0.851388 -1.068542
H  5.545818 -1.19907 0.559792
H  3.228891 -0.578604 -4.447027
H  -1.343831 0.345025 4.057321
H  -2.63546 -0.618785 4.772646
H  -5.647223 -2.984495 0.562537
H  -3.271756 -3.872644 3.250819
H  -6.908597 0.076776 -1.477484
H  -6.033489 1.213593 -0.456929
H  -7.223385 0.122702 0.249646
H  -1.202917 -2.464969 4.174198
H  3.444625 1.415598 3.639972
H  3.950073 1.083753 2.044007
H  0.834804 -0.882329 3.757349
H  1.94673 0.092745 4.651662
H  5.814677 0.871998 -3.051039
H  7.487476 0.755606 -3.190864
H  8.440463 -1.234577 -2.937113
H  7.767549 -2.398867 -1.920645
H  1.33616 -1.26957 1.533798
elementType: O N C H
totalener: -2110.49761740 hartree
nucrepener: 5469.59160612 hartree
electener: -7580.08922352 hartree
twoeener: 6168.05410195 hartree
cpcmener: -0.16469162 hartree
kineticenergy: 2101.39306457 hartree
xcener: -194.560583866785 hartree
chargesum: 1.0000000
charge: -0.348633 -0.378332 -0.383375 -0.404683 -0.432129 -0.451248 -0.445550 -0.420110 -0.450338 -0.430914 -0.403854 -0.442068 -0.162654 -0.528390 -0.341477 -0.244101 -0.293286 -0.311747 -0.300622 0.057961 0.062851 0.347331 0.204873 0.031874 0.067966 0.127893 0.108335 0.128300 0.109584 0.257348 0.075974 0.087743 0.132879 0.108786 -0.304251 0.189392 0.036469 0.414048 -0.187595 0.315890 0.100164 0.105011 0.111253 0.120414 0.090121 0.094655 0.095025 0.093648 0.082753 0.136449 0.088889 0.085798 0.091847 0.061550 0.108258 0.087394 0.101757 0.119990 0.241716 0.250500 0.138711 0.236492 0.222873 0.094499 0.106649 0.238298 0.244313 0.108459 0.078060 0.097035 0.244563 0.193413 0.205630 0.235404 0.201231 0.189968 0.169190 0.177273 0.174528 0.176080
qa: -0.3486 -0.3783 -0.3834 -0.4047 -0.4321 -0.4512 -0.4456 -0.4201 -0.4503 -0.4309 -0.4039 -0.4421 -0.1627 -0.5284 -0.3415 -0.2441 -0.2933 -0.3117 -0.3006 0.0580 0.0629 0.3473 0.2049 0.0319 0.0680 0.1279 0.1083 0.1283 0.1096 0.2573 0.0760 0.0877 0.1329 0.1088 -0.3043 0.1894 0.0365 0.4140 -0.1876 0.3159 0.1002 0.1050 0.1113 0.1204 0.0901 0.0947 0.0950 0.0936 0.0828 0.1364 0.0889 0.0858 0.0918 0.0616 0.1083 0.0874 0.1018 0.1200 0.2417 0.2505 0.1387 0.2365 0.2229 0.0945 0.1066 0.2383 0.2443 0.1085 0.0781 0.0970 0.2446 0.1934 0.2056 0.2354 0.2012 0.1900 0.1692 0.1773 0.1745 0.1761
va: 1.9982 1.9646 1.9899 2.0174 2.0276 1.9813 1.9949 2.0063 1.9818 2.0071 2.0630 1.9665 3.2849 2.8832 2.9625 3.2931 3.2966 3.1656 3.1276 3.9612 3.9145 3.7095 4.0675 3.8454 4.0284 4.0197 3.9266 3.8987 3.7686 4.0082 3.8769 4.0071 3.8242 3.8423 3.9901 3.9636 3.8381 4.2065 3.9515 4.3327 1.0530 1.0216 1.0256 1.0282 1.0217 1.0308 1.0302 1.0303 1.0434 0.9759 1.0296 1.0363 1.0195 1.0395 1.0024 1.0155 1.0019 1.0056 1.0077 1.0292 1.0339 1.0313 1.0236 1.0070 0.9988 1.0276 0.9971 0.9941 0.9933 0.9953 1.0296 1.0033 1.0227 1.0412 1.0000 1.0245 1.0148 1.0079 1.0212 1.0152
dispersion: -0.052906148 hartree
energy: -2110.550523544570 hartree
dipole: -4.69258 7.46768 2.77510 1.33969 -0.67881 0.66088 -2.27715 3.31300 1.03585
magnitude: 3.03495 au
magnitude: 7.71423 debye
