program: Orca
programVersion: 5.0.2
elementType: O O O O O O O O O O O O N N N N N N N C C C C C C C C C C C C C C C C C C C C C H H H H H H H H H H H H H H H H H H H H H H H H H H H H H H H H H H H H H H H H
charge: 1
multiplicity: 1
keywords: wb97x-d3
keywords: def2-TZVPP
keywords: def2/J RIJCOSX
keywords: DEFGRID2
keywords: scfconv7
keywords: smallprint printgap noloewdin
keywords: NOSOSCF
formula: C21H40N7O12
InChI: InChI=1/C21H40N7O12/c1-5-21(36,4-30)16(40-17-9(26-2)13(34)10(31)6(3-29)38-17)18(37-5)39-15-8(28-20(24)25)11(32)7(27-19(22)23)12(33)14(15)35/h4-18,26,28-29,31-36H,3,22-25H2,1-2H3
80 atoms
O  0.471704 0.676766 -0.550701
O  -0.762413 1.445253 -2.352419
O  -2.763059 0.138378 -0.033171
O  -3.085884 0.400734 2.252973
O  -3.611168 2.0066 -1.806566
O  1.183909 -0.259531 -3.325997
O  4.66723 -0.940698 0.924955
O  3.878645 -0.603077 -3.787453
O  -4.917065 -3.185601 1.355174
O  -2.520828 -3.10916 2.967161
O  -2.107501 4.022101 0.596488
O  -0.844353 -1.395608 4.443761
N  1.961012 -0.42705 1.493759
N  5.51467 -1.525941 -1.617331
N  -5.39203 -0.971095 -0.334661
N  3.242981 1.102266 2.677574
N  1.666691 -0.165407 3.752578
N  6.687612 0.217366 -2.71505
N  7.72556 -1.758951 -2.169235
C  -1.854255 1.170126 -0.288578
C  1.474012 -0.263034 -0.897667
C  -2.466007 2.358229 -1.083856
C  -0.753407 0.617307 -1.217057
C  2.541431 -0.144598 0.194155
C  2.094378 -0.000436 -2.278224
C  3.719632 -1.062743 -0.109389
C  -1.264126 2.725606 -1.977378
C  3.303792 -0.898431 -2.534291
C  4.352461 -0.696638 -1.450638
C  -3.69632 0.338872 0.992803
C  -4.692915 -0.819475 0.925217
C  -3.987071 -2.127191 1.284937
C  -3.309305 -1.979824 2.636551
C  -2.38001 -0.765738 2.647967
C  -1.580534 3.542488 -3.202284
C  -2.859029 3.516645 -0.199312
C  -1.838747 -0.473269 4.044109
C  2.301515 0.159672 2.6376
C  -6.405282 0.043207 -0.573203
C  6.564554 -1.033398 -2.179688
H  -1.392033 1.544362 0.631025
H  1.05037 -1.278337 -0.888478
H  -0.974282 -0.405108 -1.538893
H  2.892444 0.892491 0.190318
H  2.431644 1.045551 -2.304274
H  3.349848 -2.098245 -0.166014
H  -0.519543 3.252279 -1.367554
H  2.970506 -1.947677 -2.506641
H  4.594349 0.378209 -1.407272
H  -4.212847 1.299642 0.883564
H  -5.446465 -0.621826 1.695944
H  -3.218556 -2.346391 0.528454
H  -4.088521 -1.820366 3.39595
H  -1.529763 -0.948256 1.97471
H  -0.671729 3.740799 -3.769996
H  -2.293343 3.045618 -3.859107
H  -1.999283 4.50501 -2.90716
H  -3.890365 3.882647 -0.335947
H  -3.412165 1.287444 -2.418677
H  0.602342 0.505062 -3.425368
H  -4.719028 -0.952181 -1.092206
H  5.485911 -1.316145 0.567658
H  3.188904 -0.682228 -4.456331
H  -1.377102 0.516387 4.048256
H  -2.666577 -0.450618 4.763803
H  -5.487203 -3.086964 0.580942
H  -3.100975 -3.809621 3.283667
H  -6.868587 -0.129581 -1.543786
H  -6.039275 1.075067 -0.563839
H  -7.189599 -0.033599 0.180246
H  -1.175884 -2.284268 4.252705
H  3.484384 1.498579 3.572898
H  3.974432 1.110844 1.985421
H  0.817225 -0.72739 3.768479
H  1.957266 0.24818 4.624387
H  5.857575 0.630468 -3.105046
H  7.519069 0.408209 -3.251472
H  8.348874 -1.632177 -2.951823
H  7.614004 -2.72198 -1.897326
H  1.29364 -1.185305 1.549533
elementType: O N C H
totalener: -2110.49757829 hartree
nucrepener: 5473.48405479 hartree
electener: -7583.98163308 hartree
twoeener: 6171.98752858 hartree
cpcmener: -0.16431524 hartree
kineticenergy: 2101.38855560 hartree
xcener: -194.559590813815 hartree
chargesum: 1.0000000
charge: -0.349011 -0.381225 -0.382691 -0.404932 -0.432181 -0.446887 -0.444122 -0.419880 -0.449582 -0.428654 -0.403132 -0.442296 -0.162670 -0.529459 -0.339094 -0.243519 -0.292222 -0.312146 -0.300876 0.057365 0.062770 0.340103 0.209189 0.033552 0.071136 0.124548 0.110936 0.125235 0.114130 0.256405 0.076651 0.086417 0.133462 0.105639 -0.304060 0.187459 0.038297 0.413208 -0.187942 0.314805 0.099044 0.106068 0.108037 0.119918 0.091154 0.093635 0.095426 0.094291 0.082255 0.137153 0.088626 0.085894 0.093010 0.059707 0.108322 0.087483 0.101229 0.121531 0.241724 0.250973 0.137853 0.235809 0.222661 0.096267 0.106164 0.238094 0.243666 0.108329 0.078191 0.096877 0.245042 0.193640 0.204731 0.234566 0.200733 0.190095 0.168963 0.176848 0.174231 0.177034
qa: -0.3490 -0.3812 -0.3827 -0.4049 -0.4322 -0.4469 -0.4441 -0.4199 -0.4496 -0.4287 -0.4031 -0.4423 -0.1627 -0.5295 -0.3391 -0.2435 -0.2922 -0.3121 -0.3009 0.0574 0.0628 0.3401 0.2092 0.0336 0.0711 0.1245 0.1109 0.1252 0.1141 0.2564 0.0767 0.0864 0.1335 0.1056 -0.3041 0.1875 0.0383 0.4132 -0.1879 0.3148 0.0990 0.1061 0.1080 0.1199 0.0912 0.0936 0.0954 0.0943 0.0823 0.1372 0.0886 0.0859 0.0930 0.0597 0.1083 0.0875 0.1012 0.1215 0.2417 0.2510 0.1379 0.2358 0.2227 0.0963 0.1062 0.2381 0.2437 0.1083 0.0782 0.0969 0.2450 0.1936 0.2047 0.2346 0.2007 0.1901 0.1690 0.1768 0.1742 0.1770
va: 1.9950 1.9591 1.9923 2.0137 2.0263 1.9839 1.9958 2.0066 1.9826 2.0105 2.0637 1.9691 3.2842 2.8840 2.9635 3.2942 3.2952 3.1640 3.1259 3.9546 3.9169 3.7077 4.0594 3.8411 4.0212 4.0292 3.9276 3.8944 3.7664 4.0014 3.8839 4.0087 3.8190 3.8573 3.9893 3.9617 3.8376 4.2090 3.9515 4.3332 1.0536 1.0206 1.0281 1.0282 1.0220 1.0316 1.0285 1.0294 1.0431 0.9758 1.0302 1.0363 1.0191 1.0391 1.0025 1.0157 1.0018 1.0052 1.0076 1.0224 1.0332 1.0309 1.0236 1.0065 0.9992 1.0276 0.9980 0.9944 0.9938 0.9951 1.0311 1.0032 1.0220 1.0431 1.0003 1.0248 1.0149 1.0080 1.0214 1.0145
dispersion: -0.052877078 hartree
energy: -2110.550455365894 hartree
dipole: -4.54212 7.39509 2.85297 1.06934 -0.44398 0.62536 -2.49729 3.33032 0.83303
magnitude: 3.03718 au
magnitude: 7.71990 debye
