program: Gaussian 09
title: 000060949
version: EM64L-G09RevD.01
frameworkgroup: C1[X(C16H22N4O3)]
method: RPBEPBE
basis: SDD
operation: Freq
keyword: #p
keyword: freq=noraman
keyword: PBEPBE/SDD
title: #p freq=noraman PBEPBE/SDD
converged: YES YES NO NO
title: Mulliken charges:
elementType: O O O N N N N C C C C C C C C C C C C C C C C H H H H H H H H H H H H H H H H H H H H H H
charge: -0.183415 -0.261706 -0.262132 -0.414509 -0.183333 -0.086646 -0.231462 -0.248956 -0.436149 -0.518720 -0.516983 0.236611 0.151266 0.086417 0.059031 0.106005 -0.328392 0.194080 -0.303465 -0.358865 -0.360204 -0.686004 -0.690116 0.237982 0.236705 0.228589 0.255447 0.266156 0.269787 0.255814 0.335313 0.242222 0.232695 0.238582 0.238573 0.213665 0.228672 0.228296 0.221806 0.217299 0.217043 0.221736 0.214798 0.216224 0.220243
chargesum: 0.00000
title: Mulliken charges with hydrogens summed into heavy atoms:
elementType: O O O N N N N C C C C C C C C C C C C C C C C
charge: -0.183415 -0.261706 -0.262132 -0.079196 -0.183333 -0.086646 -0.231462 -0.010975 0.029145 0.002883 0.008617 0.236611 0.151266 0.086417 0.059031 0.106005 0.146526 0.194080 0.173689 0.083473 0.089898 -0.029926 -0.038851
polarizability: 2.77545248e+02 -6.36147367e+00 2.17608433e+02 -1.72082914e+00 -4.72521941e+00 1.40604103e+02
1716.lowfreq: -5.9636 -3.9479 -0.0007 -0.0004 -0.0003 5.0663 21.6784 27.3247 33.6330
frequency: 20.2214 27.3081 33.4912 41.1612 42.7287 59.5093 76.9966 78.7881 82.0222 116.9704 126.6578 152.3778 160.1757 191.7978 223.8894 229.1049 232.1959 251.5390 269.2340 282.4972 298.5336 344.1112 348.6383 371.5133 390.8482 402.6069 409.2115 441.9118 458.8001 490.8029 542.7842 562.1543 575.5549 650.8520 660.6801 669.6291 675.7100 704.0152 708.8295 727.8728 728.3926 743.3825 745.5914 774.7387 780.2161 812.0416 857.4743 879.7984 887.1801 891.7466 896.6566 904.0377 949.8395 956.2428 986.6807 998.7906 1002.0983 1050.5095 1053.1268 1060.1961 1068.8420 1109.2343 1114.5972 1115.8743 1127.8919 1141.5830 1152.5404 1169.5964 1177.8245 1184.5710 1193.4039 1235.2035 1237.5788 1258.6271 1263.3430 1269.7898 1272.8621 1280.6339 1304.4502 1305.2781 1307.7855 1313.1571 1326.5518 1331.8298 1364.6443 1368.2665 1386.6015 1392.6646 1395.8516 1399.4337 1419.7476 1427.2981 1438.8703 1448.9872 1464.9244 1473.3518 1474.0320 1475.8668 1480.0464 1481.7992 1485.1480 1486.0383 1522.4661 1572.5282 1611.6889 1652.2659 1669.0003 2977.0501 2979.4395 2993.2431 2996.2833 3001.0891 3004.1874 3008.7640 3028.6655 3030.2831 3034.7646 3043.8189 3045.5037 3075.0232 3076.3912 3076.4656 3079.8296 3082.1983 3088.4775 3091.7136 3102.2697 3106.1020 3582.7723
redmass: 5.0446 3.4789 3.9728 4.0944 5.0360 5.7095 2.2983 2.6681 1.7818 4.0064 4.9429 4.4831 5.2155 3.8795 1.3722 1.8495 1.1367 4.2109 3.0602 3.5628 2.4215 4.9714 3.0030 5.5728 6.4047 6.5922 4.6888 2.4972 4.4229 6.6927 5.6749 5.6174 3.5292 3.6616 3.6873 2.2737 2.1279 3.9728 3.9607 5.5496 1.7821 10.5188 1.1246 2.4127 2.8717 2.6126 1.3644 1.8919 1.6144 1.8278 2.2675 1.7334 3.1108 2.4026 2.9084 2.4613 2.3553 3.0416 2.9891 2.3577 2.9706 3.3010 2.2385 2.2783 1.5305 1.4427 2.8505 1.4697 1.9287 1.9939 2.1808 1.3796 3.7491 2.7965 1.4003 1.5379 1.4876 1.4640 1.3578 1.3433 1.4827 1.3119 1.9300 1.2507 1.3701 1.4618 3.5641 1.2133 1.2152 2.3552 1.1185 1.1152 1.1455 1.1231 2.0653 1.0639 1.0720 1.5832 1.0467 1.0560 1.0722 1.0714 4.6272 8.9381 10.2628 10.4860 12.1232 1.0357 1.0358 1.0599 1.0595 1.0669 1.0639 1.0633 1.0836 1.0597 1.0585 1.1003 1.1012 1.1018 1.1014 1.1000 1.0989 1.0991 1.1010 1.0970 1.1064 1.1066 1.0820
irintensity: 1.3679 0.5753 0.7477 1.7366 2.7262 0.4683 0.2137 0.7990 0.1093 1.8266 0.0337 2.8609 6.0377 7.7906 0.8502 3.1519 0.0862 9.4012 3.2772 3.1845 6.9186 8.6098 6.5718 10.6353 6.9393 2.3299 2.0281 0.6868 3.1691 10.1824 19.4745 3.7187 8.1834 10.5644 6.6180 35.6524 48.9199 6.8662 6.4186 1.4419 3.3549 11.7392 13.6467 4.6104 4.2776 2.7997 0.0175 2.9990 9.1360 8.2995 7.1147 22.6131 7.9180 8.6332 2.4713 13.5094 11.9939 9.6657 4.0829 1.5759 28.1699 4.1017 8.1075 12.5567 18.8362 17.2844 59.2091 6.7723 12.2334 37.4755 0.7748 5.2128 68.3834 47.1971 8.6214 17.3856 4.1501 5.7191 0.6381 0.3792 2.1701 29.7262 126.5528 11.7961 1.9818 13.2185 5.5687 9.9714 16.3113 43.3632 37.5077 9.3787 24.5901 30.4076 112.7627 2.1075 8.3156 156.0862 8.8674 2.8969 15.1791 17.4462 38.3135 7.5995 507.8545 538.9535 169.9253 42.9009 34.3488 14.7385 14.5658 13.4131 25.5747 8.2337 36.5337 22.2480 26.7446 1.9447 0.1553 39.8881 45.9808 9.9419 40.2671 39.3810 25.3596 7.1567 13.6330 8.2103 78.9718
temp: 298.150 k
press: 1.00000 atm
elementType: 8 8 8 7 7 7 7 6 6 6 6 6 6 6 6 6 6 6 6 6 6 6 6 1 1 1 1 1 1 1 1 1 1 1 1 1 1 1 1 1 1 1 1 1 1
symmnumber: 1
zpe: 967488.1 jmol-1
zpe.correction: 0.368497 hartree
zpe.thermalcorrener: 0.391245 hartree
zpe.thermalcorrenthalpy: 0.392189 hartree
zpe.thermalcorrgfe: 0.313660 hartree
zpe.sumelectzpe: -1065.911419 hartree
zpe.sumelectthermal: -1065.888671 hartree
zpe.sumelectthermalent: -1065.887726 hartree
zpe.sumelectthermalfe: -1065.966255 hartree
dipole: -1.8112 -3.1923 2.0507
dipole: 4.2044
quadrupole: -153.0785 -136.3136 -134.1192
quadrupole: 19.0925 -6.0683 2.5739
quadrupole: -11.9080 4.8568 7.0512 19.0925 -6.0683 2.5739
hfenergy: -1066.2799156 hartree
pointgroup: C01 [X(C16H22N4O3)]
dipole: -0.7499585 -1.2875851 0.7182087 debye
polarizability: 277.3552746|-7.1835662|218.1075762|1.1174295|-0.5418181|140.294933 unknown
InChI: InChI=1S/C16H22N4O3/c1-3-7-19-14-12(15(22)20(8-4-2)16(19)23)17-13(18-14)10-5-6-11(21)9-10/h10,17H,3-9H2,1-2H3
charge 0 multiplicity 1
45 atoms
O  -5.409045 1.081247 -0.702548
O  2.390863 -2.801823 -0.216037
O  3.070387 1.869165 -0.515109
N  -0.637188 -2.103726 -0.186236
N  0.860391 1.103494 -0.44405
N  -1.381737 0.038479 -0.308278
N  2.716289 -0.454158 -0.387535
C  -3.164718 -1.770557 -0.119009
C  -3.783367 -1.490044 1.304492
C  -4.11459 -1.001152 -1.078688
C  -4.303167 -0.037435 1.224113
C  -1.749164 -1.272782 -0.215404
C  -4.704942 0.15309 -0.245472
C  0.008395 0.015644 -0.339703
C  0.501315 -1.294326 -0.266135
C  1.898882 -1.632042 -0.282545
C  0.331266 2.490128 -0.495408
C  2.262278 0.898844 -0.448975
C  4.192432 -0.654343 -0.393089
C  0.160232 3.110729 0.908747
C  4.799641 -0.577561 1.024917
C  -0.396553 4.546908 0.817141
C  6.326537 -0.797412 0.987405
H  -3.16836 -2.856057 -0.328489
H  -3.051514 -1.646765 2.114596
H  -4.624089 -2.190453 1.467358
H  -4.950217 -1.650599 -1.405809
H  -3.62436 -0.608266 -1.983986
H  -3.492732 0.68649 1.435224
H  -5.144312 0.190496 1.899697
H  -0.621418 -3.122175 -0.130037
H  1.043579 3.087907 -1.088481
H  -0.640228 2.449218 -1.018003
H  4.375807 -1.649944 -0.831342
H  4.630606 0.126359 -1.03669
H  -0.524532 2.477374 1.504747
H  1.141103 3.115942 1.419714
H  4.571617 0.413152 1.46026
H  4.322912 -1.345314 1.663114
H  0.284317 5.202478 0.242823
H  -1.384315 4.562277 0.319487
H  -0.518855 4.98782 1.822404
H  6.577047 -1.788108 0.563721
H  6.824918 -0.026766 0.369971
H  6.758791 -0.74623 2.002727
