program: Orca
programVersion: 5.0.2
elementType: O O O O O O O O O O O O N N N N N N N C C C C C C C C C C C C C C C C C C C C C H H H H H H H H H H H H H H H H H H H H H H H H H H H H H H H H H H H H H H H H
charge: 1
multiplicity: 1
keywords: wb97x-d3
keywords: def2-TZVPP
keywords: def2/J RIJCOSX
keywords: DEFGRID2
keywords: scfconv7
keywords: smallprint printgap noloewdin
keywords: NOSOSCF
formula: C21H40N7O12
InChI: InChI=1/C20H36N6O12.CH4N/c1-5-20(34,4-28)16(37-8-2-6(29)11(30)7(3-27)36-8)17(35-5)38-15-10(26-19(23)24)12(31)9(25-18(21)22)13(32)14(15)33;1-2/h4-17,27,29-34H,2-3,21-24H2,1H3;1-2H2
80 atoms
O  -1.143618 -1.567272 1.118582
O  -2.688067 -0.461302 2.330926
O  -1.010281 1.758194 0.435484
O  -0.486219 1.942657 -1.822106
O  -3.4747 2.263794 1.432857
O  1.431072 -1.437812 2.845501
O  2.119284 -3.438666 -1.925506
O  1.747684 -4.519537 1.070377
O  1.929878 4.794297 0.054872
O  3.103448 2.664479 -1.476326
O  -4.305693 0.386882 -1.376653
O  0.430726 -0.044592 -3.475805
N  -0.449177 -1.904473 -1.621368
N  3.199911 -1.195987 0.678178
N  -0.108498 2.710054 3.667228
N  -2.2667 -3.358002 -1.191045
N  -2.3200 -1.877994 -2.947613
N  4.633146 -0.783512 -1.155908
N  4.228008 0.84044 0.428362
C  -1.889042 0.668453 0.421177
C  0.220529 -1.702011 0.752252
C  -3.364994 1.064253 0.717966
C  -1.527654 -0.298766 1.575976
C  0.344713 -2.475156 -0.562569
C  0.999833 -2.389068 1.891124
C  1.819098 -2.415996 -0.996228
C  -3.818904 -0.174487 1.513632
C  2.193652 -3.215365 1.379267
C  2.817739 -2.503247 0.181333
C  -1.028919 2.584925 -0.70241
C  -0.273294 3.854675 -0.365252
C  1.222628 3.603754 -0.221689
C  1.7193 2.91516 -1.49172
C  0.902902 1.640199 -1.744722
C  -5.04251 0.011327 2.372676
C  -4.184952 1.243405 -0.536054
C  1.301408 0.978143 -3.058718
C  -1.638749 -2.351019 -1.858446
C  -0.484858 3.816891 3.177599
C  3.982356 -0.451065 -0.011662
H  -1.839269 0.123046 -0.526247
H  0.653902 -0.708991 0.579666
H  -0.749372 0.124124 2.219167
H  0.089903 -3.526253 -0.381848
H  0.314763 -3.070897 2.405485
H  1.95751 -1.434166 -1.468588
H  -3.990579 -0.998959 0.810166
H  2.938691 -3.254003 2.184929
H  3.689413 -3.084398 -0.156671
H  -2.058256 2.832017 -0.98846
H  -0.438818 4.565551 -1.180962
H  1.414039 2.946961 0.634092
H  1.544254 3.59787 -2.334998
H  1.087121 0.932494 -0.921579
H  -5.899037 0.271573 1.750352
H  -5.285202 -0.915696 2.891594
H  -4.910665 0.794472 3.118518
H  -4.685159 2.22158 -0.634276
H  -3.037676 2.181824 2.289706
H  2.134999 -0.94999 2.380082
H  0.857116 2.552889 3.939979
H  1.482504 -3.368029 -2.646433
H  2.471722 -4.993477 0.646485
H  1.316333 1.7317 -3.85345
H  2.329786 0.614061 -2.94754
H  1.753279 5.419577 -0.658135
H  3.329647 2.044747 -0.75311
H  0.229712 4.619159 3.064339
H  -1.519116 3.951008 2.897541
H  -0.694861 4.309777 0.533093
H  0.244212 -0.67934 -2.738959
H  -3.242783 -3.511294 -1.38868
H  -2.019059 -3.509059 -0.228378
H  -1.943224 -1.030982 -3.342919
H  -3.325696 -1.860204 -2.872197
H  4.346981 -1.610547 -1.652762
H  4.958824 -0.036161 -1.748616
H  5.174818 1.163627 0.273826
H  3.9465 0.977855 1.388908
H  -0.756536 1.934669 3.775974
elementType: O N C H
totalener: -2110.44353139 hartree
nucrepener: 5862.29207902 hartree
electener: -7972.73561041 hartree
twoeener: 6562.20398535 hartree
cpcmener: -0.24067480 hartree
kineticenergy: 2101.34371047 hartree
xcener: -194.486400788718 hartree
chargesum: 1.0000000
charge: -0.385206 -0.380552 -0.382174 -0.397562 -0.439736 -0.501120 -0.441923 -0.438941 -0.452987 -0.502412 -0.409833 -0.520696 -0.520660 -0.590039 -0.053665 -0.277642 -0.300582 -0.281063 -0.255580 -0.004574 -0.022018 0.373621 0.243894 0.317874 0.216787 -0.223120 0.123250 0.005980 0.477877 0.315748 -0.274151 0.216155 0.113409 0.145648 -0.299228 0.179735 0.012871 0.301011 0.150120 0.259244 0.061947 0.083177 0.070973 0.092818 0.086700 0.074868 0.092375 0.092875 0.110336 0.131793 0.111088 0.087987 0.098495 0.023677 0.099843 0.107440 0.085941 0.126657 0.249130 0.241080 0.264211 0.236124 0.227303 0.105770 0.073951 0.235666 0.228327 0.175858 0.178465 0.096124 0.243241 0.171222 0.187546 0.177540 0.178016 0.185784 0.185427 0.171706 0.181360 0.269400
qa: -0.3852 -0.3806 -0.3822 -0.3976 -0.4397 -0.5011 -0.4419 -0.4389 -0.4530 -0.5024 -0.4098 -0.5207 -0.5207 -0.5900 -0.0537 -0.2776 -0.3006 -0.2811 -0.2556 -0.0046 -0.0220 0.3736 0.2439 0.3179 0.2168 -0.2231 0.1233 0.0060 0.4779 0.3157 -0.2742 0.2162 0.1134 0.1456 -0.2992 0.1797 0.0129 0.3010 0.1501 0.2592 0.0619 0.0832 0.0710 0.0928 0.0867 0.0749 0.0924 0.0929 0.1103 0.1318 0.1111 0.0880 0.0985 0.0237 0.0998 0.1074 0.0859 0.1267 0.2491 0.2411 0.2642 0.2361 0.2273 0.1058 0.0740 0.2357 0.2283 0.1759 0.1785 0.0961 0.2432 0.1712 0.1875 0.1775 0.1780 0.1858 0.1854 0.1717 0.1814 0.2694
va: 1.8844 1.9856 1.9921 1.9957 2.0283 1.9373 1.9769 2.0167 1.9787 1.9400 2.0578 1.8834 2.8539 2.9334 3.6060 3.2269 3.1583 3.2407 3.1434 4.0197 3.7423 3.6522 4.1287 3.3010 3.7600 4.1048 3.8937 4.1753 3.1565 3.9461 3.9228 3.8802 3.9051 3.7015 3.9858 3.9462 3.9781 4.3044 3.7630 4.3098 1.0879 1.0295 1.0497 1.0842 1.0444 1.0360 1.0289 1.0329 1.0107 0.9868 1.0233 1.0231 1.0218 1.0318 1.0023 1.0037 1.0143 1.0057 1.0001 1.0505 0.9471 1.0096 1.0104 1.0035 1.0157 0.9973 1.0859 0.9856 0.9785 1.0196 1.0865 1.0166 1.0196 1.0362 1.0147 1.0194 1.0116 1.0113 1.0150 0.9449
dispersion: -0.064805780 hartree
energy: -2110.508337170838 hartree
dipole: 2.25038 -2.43067 -0.18029 9.12664 -2.48152 6.64512 4.64833 1.70599 6.35431
magnitude: 9.19605 au
magnitude: 23.37451 debye
