program: Orca
programVersion: 5.0.2
elementType: O O N C C C C H H H H
charge: -1
multiplicity: 1
keywords: wb97x-d3
keywords: def2-TZVPP
keywords: def2/J RIJCOSX
keywords: DEFGRID2
keywords: scfconv7
keywords: smallprint printgap noloewdin
keywords: NOSOSCF
formula: C4H4NO2
InChI: InChI=1/C4H4NO2/c1-3-2-4(6)5-7-3/h2H,1H3
11 atoms
O  -0.648348 -1.086671 -0.00031
O  2.378266 0.514338 -0.000066
N  0.764121 -1.130557 -0.000624
C  -1.051647 0.179028 0.000231
C  -0.000543 1.013482 -0.000006
C  1.189953 0.144908 0.000847
C  -2.521429 0.420129 0.000041
H  -0.011504 2.092333 -0.00036
H  -2.728143 1.48971 0.00202
H  -3.004576 -0.016661 0.877994
H  -3.003859 -0.01317 -0.880043
totalener: -360.05644022 hartree
nucrepener: 283.11070845 hartree
electener: -643.16714867 hartree
oneelecener: -1061.58813785 hartree
twoeener: 418.42098918 hartree
kineticenergy: 358.72748910 hartree
xcener: -32.996137580530 hartree
energy: -520.0495 -515.7901 -387.0920 -276.6804 -276.3296 -275.9299 -274.4514 -28.6523 -24.5005 -20.7732 -19.6989 -18.1653 -14.0471 -12.7262 -11.4536 -11.2379 -10.1844 -9.6672 -9.5374 -8.3281 -7.6773 -6.9998 -5.4130 -4.4156 -3.3653 -2.5830 6.5635 6.9986 7.9042 8.8163 8.9352 9.3664 10.0347 10.2114 10.6076 11.2897 11.4568 11.7319 12.7536 13.2603 13.3551 14.9252 15.1558 15.1644 15.5277 15.5325 15.7355 16.3858 16.8792 17.4584 17.7882 17.8087 18.0293 18.8603 19.6579 19.9234 20.2958 20.6168 21.2603 21.2732 21.5814 22.2428 22.5923 23.6188 24.0975 24.3582 25.4346 26.0369 26.1884 26.8457 28.0333 28.3195 28.7764 29.0395 30.0569 30.8439 31.1810 31.5586 32.5366 33.0143 33.2901 33.6769 34.1317 35.0589 35.8297 36.2339 37.7063 38.0786 38.4861 39.0992 40.4162 40.7416 41.1742 41.6546 42.1883 42.9769 44.0083 44.8545 44.8635 45.2957 45.4942 46.0706 47.3133 47.4419 47.8790 48.4404 50.3039 50.6129 51.1786 51.3077 53.8059 54.5849 54.7432 55.6924 56.5497 57.0562 58.5265 59.6058 59.7313 61.6035 62.5922 63.0466 63.8549 64.9907 65.2062 66.3611 66.9098 68.9602 69.8400 70.7011 71.0984 72.0463 72.3234 73.6027 73.8778 74.6501 76.0895 76.4063 78.6752 78.7094 79.0686 80.3990 81.4463 81.5584 82.2404 82.4058 84.2245 84.6138 85.1558 85.7837 86.8931 87.3604 87.4906 87.7934 88.7943 89.3832 90.0036 90.4662 91.1774 91.6083 92.5287 92.5986 92.8887 93.7152 93.8082 95.7849 95.8608 96.4633 96.7137 96.9540 97.3249 99.0553 99.1647 100.3359 100.5673 100.7897 101.5605 102.0303 102.8097 103.4583 103.5169 105.0649 105.3694 106.2991 107.7852 108.7422 108.8306 110.7600 111.1625 111.9588 112.3146 112.3558 113.4124 114.8858 114.9860 115.7312 116.2901 116.9231 117.5725 118.3576 118.8978 120.0587 120.3944 122.0720 123.4367 123.9754 125.7497 125.7782 127.3137 128.4363 128.4975 130.7150 130.8678 133.1254 133.2527 134.3921 136.2915 136.9777 137.1577 138.0341 138.3860 139.3348 141.8841 142.3157 142.6374 144.1243 146.1287 147.0976 147.5689 147.9047 148.9572 149.7096 151.4250 151.5818 152.1398 152.2332 152.6357 153.2592 156.0164 156.8283 157.3377 159.3909 159.8568 160.9776 162.1161 162.4117 166.3779 167.1971 167.4620 169.0541 174.2090 176.2386 181.8129 182.9133 185.0760 187.4632 188.9987 190.3911 193.4274 194.6310 195.9704 196.9719 201.1999 202.8389 205.0019 218.8134 629.6623 645.7878 646.2630 648.8095 881.4600 1204.3676 1208.9350 electronvolt
chargesum: -1.0000000
charge: -0.201544 -0.573988 -0.283541 0.181021 -0.317559 0.155601 -0.256075 0.066026 0.073605 0.078234 0.078218
qa: -0.2015 -0.5740 -0.2835 0.1810 -0.3176 0.1556 -0.2561 0.0660 0.0736 0.0782 0.0782
va: 2.1195 1.9654 2.5045 3.7943 3.7357 4.6656 3.9860 1.0160 1.0058 0.9979 0.9978
dispersion: -0.002213035 hartree
energy: -360.058653254556 hartree
dipole: -8.21343 5.31330 -2.90014 3.32957 -2.57323 0.75634 -0.00030 0.00091 0.00060
magnitude: 2.99714 au
magnitude: 7.61812 debye
