program: Orca
programVersion: 5.0.2
elementType: O O N C C C C H H H H
charge: -1
multiplicity: 1
keywords: wb97x-d3
keywords: def2-TZVPP
keywords: def2/J RIJCOSX
keywords: DEFGRID2
keywords: scfconv7
keywords: smallprint printgap noloewdin
keywords: NOSOSCF
formula: C4H4NO2
InChI: InChI=1/C4H4NO2/c1-3-2-4(6)5-7-3/h2H,1H3
11 atoms
O  -0.651318 -1.076208 0.001786
O  2.381895 0.501193 0.000204
N  0.753624 -1.130463 0.002729
C  -1.05013 0.191851 -0.000957
C  0.007304 1.019428 -0.001767
C  1.190344 0.14301 -0.000713
C  -2.524436 0.425245 0.000686
H  0.0060 2.098523 -0.003016
H  -3.06477 -0.521833 -0.022275
H  -2.841126 1.009426 -0.865866
H  -2.846893 0.969373 0.891128
totalener: -360.05504329 hartree
nucrepener: 283.18893907 hartree
electener: -643.24398236 hartree
oneelecener: -1061.74964732 hartree
twoeener: 418.50566496 hartree
kineticenergy: 358.72987992 hartree
xcener: -32.996910095777 hartree
energy: -520.1188 -515.7727 -387.0822 -276.6776 -276.3150 -275.9184 -274.3889 -28.7269 -24.4849 -20.7737 -19.6602 -18.1713 -14.0614 -12.7049 -11.4914 -11.2243 -10.0953 -9.7480 -9.5138 -8.3526 -7.6684 -6.9998 -5.4064 -4.3652 -3.3525 -2.5671 6.5288 6.9768 8.3292 8.4099 8.8054 9.3395 10.0035 10.4827 10.5262 10.8731 11.5969 12.4160 12.7356 13.1222 13.2033 14.5902 14.7994 15.1794 15.3123 15.7870 16.0638 16.2793 16.7401 17.3272 17.8457 18.0309 18.3153 19.0503 19.7362 19.8036 20.1818 20.9860 21.2634 21.5244 21.8803 22.1562 22.4189 23.4920 24.0524 24.4194 24.9861 26.0575 26.1251 27.1510 27.2322 27.7406 29.5204 29.6588 29.8669 30.9397 31.7524 32.0306 32.2124 32.6776 32.8081 33.6707 34.0238 35.0069 35.2380 35.9338 37.8606 38.1258 38.2369 38.2692 40.2371 41.4339 41.6320 41.9306 43.1885 43.3077 43.6853 44.3171 45.4083 45.5167 45.7476 46.2589 47.3332 47.4642 48.3155 48.4130 49.8749 49.9650 51.0072 51.9936 53.3579 54.4060 54.6704 55.5740 56.4929 57.5705 58.0842 59.1759 59.8144 61.9055 62.3750 64.0931 64.4453 64.7192 64.8915 65.7650 66.5011 68.1363 69.1637 70.7367 71.3106 71.3915 72.9454 73.8299 74.2528 75.2790 75.7883 76.3298 78.5218 79.2839 79.5878 79.9818 80.8557 81.8603 82.1424 83.4394 83.8468 84.8472 84.9995 85.6140 87.0906 87.3236 87.6578 87.8598 88.5935 89.4628 89.6816 90.7894 91.2219 91.4721 91.7082 92.5296 93.1416 94.4707 94.6171 95.4318 95.9820 96.2609 96.6109 96.8754 97.5364 98.9160 99.1231 100.1938 100.3233 101.2668 101.6268 101.6992 102.6861 103.7718 103.8541 105.5044 105.9577 106.3690 108.2203 108.7486 109.2979 110.6213 111.4595 111.6215 112.7986 113.0310 113.2759 114.0110 114.9855 115.5909 116.3158 116.5362 117.6599 117.8331 118.5713 120.6910 120.6930 121.6626 123.0557 124.9703 126.1779 126.2209 127.6997 127.9449 128.2160 129.0321 130.9841 132.8301 133.8238 134.7619 135.6247 136.9299 137.2623 138.0757 138.2732 139.8846 141.8145 142.0537 142.4606 144.1351 146.0956 146.8200 147.9942 148.1934 148.9516 150.8144 151.1670 151.5097 151.9771 152.1358 153.0637 153.1988 156.0986 156.2027 157.4167 158.8665 159.4751 161.2510 162.4588 162.9858 166.5313 167.5400 167.6882 169.4592 174.3314 176.2409 181.8676 182.9303 184.9952 187.3397 189.0848 190.3588 193.6070 194.6538 196.1099 197.0669 201.2528 202.8549 205.5166 219.1405 629.7984 645.0549 646.2716 649.7661 881.4792 1204.4686 1209.2320 electronvolt
chargesum: -1.0000000
charge: -0.188067 -0.574019 -0.283490 0.175324 -0.330493 0.156003 -0.255832 0.065541 0.081322 0.076774 0.076935
qa: -0.1881 -0.5740 -0.2835 0.1753 -0.3305 0.1560 -0.2558 0.0655 0.0813 0.0768 0.0769
va: 2.1298 1.9664 2.5086 3.8021 3.7386 4.6656 3.9194 1.0188 1.0179 0.9985 0.9973
dispersion: -0.002203696 hartree
energy: -360.057246987372 hartree
dipole: -8.21018 5.29479 -2.91539 3.32389 -2.57472 0.74916 -0.00141 -0.00028 -0.00170
magnitude: 3.01011 au
magnitude: 7.65109 debye
