program: Gaussian 09
title: 000072998
version: EM64L-G09RevD.01
frameworkgroup: C1[X(C16H16FN3O)]
method: RPBEPBE
basis: SDD
operation: Freq
keyword: #p
keyword: freq=noraman
keyword: PBEPBE/SDD
title: #p freq=noraman PBEPBE/SDD
converged: YES YES NO NO
title: Mulliken charges:
elementType: F O N N N C C C C C C C C C C C C C C C C H H H H H H H H H H H H H H H H
charge: -0.206859 -0.279083 -0.185124 -0.361468 -0.247079 -0.246096 0.325852 -0.553530 0.105787 0.097016 0.470787 -0.348505 -0.337102 -0.228572 -0.636304 -0.264655 -0.380051 -0.338854 -0.365992 -0.376463 0.317908 0.254775 0.236567 0.268487 0.321009 0.285226 0.247621 0.271721 0.226145 0.213131 0.224847 0.240423 0.232301 0.236966 0.265866 0.255845 0.257457
chargesum: 0.00000
title: Mulliken charges with hydrogens summed into heavy atoms:
elementType: F O N N N C C C C C C C C C C C C C C C C
charge: -0.206859 -0.279083 -0.185124 -0.040458 0.038147 0.008679 0.325852 -0.048475 0.105787 0.097016 0.470787 -0.100884 -0.065381 -0.002427 0.042097 -0.032354 -0.143085 -0.072988 -0.110147 -0.119006 0.317908
polarizability: 2.27275762e+02 -3.82162727e+00 1.97160060e+02 -2.40416532e+01 -2.65045763e+00 1.59429593e+02
1716.lowfreq: -6.4698 -3.6077 -0.0005 -0.0003 0.0006 5.4285 16.6444 26.8920 33.7337
frequency: 16.0241 26.4669 33.7140 39.9523 79.4286 110.8587 130.0881 137.2829 160.3907 203.6235 222.6182 230.2567 271.9910 276.3704 313.8549 342.6268 381.3385 393.4973 411.8933 421.3429 447.2657 469.3112 493.2511 498.8437 517.4250 555.6505 557.6358 590.6198 599.0133 627.0380 639.9398 690.1863 692.8494 702.1788 733.4341 756.9602 772.1907 789.8600 796.2096 815.3491 823.6821 827.2920 860.7354 920.4053 942.8742 958.6438 964.8356 969.5075 990.5146 1005.0344 1015.5271 1038.8020 1053.7170 1100.2346 1101.4936 1112.3182 1117.6772 1134.2407 1153.5632 1157.7042 1165.4667 1181.4590 1190.5801 1207.1744 1236.4669 1270.5497 1278.9117 1287.1615 1322.9247 1335.7863 1358.2872 1379.1516 1391.1225 1392.7639 1407.8601 1420.6651 1433.5416 1451.0859 1463.0729 1471.1967 1480.1982 1494.5659 1498.2796 1501.3142 1573.1487 1604.1039 1609.4940 1614.6826 1629.7178 2917.6242 2967.5799 2984.5866 3022.7954 3033.9946 3083.4269 3123.6907 3131.5492 3147.2528 3147.7392 3164.8699 3173.2046 3174.3861 3175.7679 3454.1787 3533.2884
redmass: 4.5661 4.1787 6.2792 5.2692 3.9118 5.0136 3.8030 3.4303 3.3650 1.5559 3.2187 6.6609 3.4172 5.1256 7.0663 2.5360 4.9217 4.9139 2.9677 3.4411 5.0267 7.4293 2.8190 3.3539 4.4953 4.3411 4.4938 1.4451 2.6363 6.5523 2.3938 3.3511 3.9241 4.1094 4.5060 2.0766 2.3177 4.8925 4.7966 1.5012 3.6807 1.4197 1.4855 1.8003 1.5851 1.9009 1.3634 1.4326 1.3307 2.8000 2.7373 2.7811 3.0822 2.5946 1.4562 1.8511 2.1253 2.3863 1.4901 1.7622 1.6589 1.1850 1.8348 3.9205 1.9273 1.4345 1.5306 1.6582 1.7172 1.5091 1.4763 2.1998 4.2382 4.7830 2.6732 1.7410 1.1508 1.2522 2.6484 1.0719 1.7531 2.6704 1.0583 1.5819 6.8773 7.5907 5.9620 6.3166 6.7713 1.0491 1.0669 1.0866 1.0849 1.0934 1.0984 1.0900 1.0865 1.0890 1.0896 1.0944 1.0952 1.0987 1.0962 1.0749 1.0767
irintensity: 0.1817 0.1115 1.2000 0.5289 4.5038 0.6398 0.5720 0.4175 2.1205 2.7731 2.0111 1.5090 3.4188 1.8349 9.2424 1.8145 4.9147 14.0515 0.0757 7.0706 2.5145 25.8450 18.2104 6.1505 5.6651 5.5425 4.6527 110.1411 16.6794 0.6618 66.8608 39.0328 4.6572 4.8062 16.7113 79.7636 11.1964 6.2054 3.8859 44.3231 13.8956 27.8630 0.6692 8.9857 36.7622 64.0374 2.4848 6.0226 0.6284 13.8228 26.9149 10.6048 11.7879 36.4401 16.3966 4.7399 146.2496 10.3806 59.7651 4.6145 9.6834 18.8786 10.8010 41.7024 43.7427 4.3498 6.2460 39.5266 42.3650 87.0530 6.7233 51.3599 1.2841 18.5113 5.8458 50.0985 3.1588 119.8523 108.8624 6.6438 69.1450 74.9816 18.0968 102.7049 0.8329 13.7505 238.8575 13.5450 292.4206 106.8558 30.2803 40.1204 38.3039 7.4741 27.8493 11.2744 5.9362 3.6353 4.1434 21.7768 4.4566 16.4680 3.5256 2.2445 26.5131
temp: 298.150 k
press: 1.00000 atm
elementType: 9 8 7 7 7 6 6 6 6 6 6 6 6 6 6 6 6 6 6 6 6 1 1 1 1 1 1 1 1 1 1 1 1 1 1 1 1
symmnumber: 1
zpe: 766114.3 jmol-1
zpe.correction: 0.291798 hartree
zpe.thermalcorrener: 0.310138 hartree
zpe.thermalcorrenthalpy: 0.311082 hartree
zpe.thermalcorrgfe: 0.242993 hartree
zpe.sumelectzpe: -957.130154 hartree
zpe.sumelectthermal: -957.111813 hartree
zpe.sumelectthermalent: -957.110869 hartree
zpe.sumelectthermalfe: -957.178958 hartree
dipole: 0.6069 -3.4913 -3.4738
dipole: 4.9623
quadrupole: -145.7041 -110.0754 -121.6085
quadrupole: 7.0539 2.2035 -4.7643
quadrupole: -19.9081 15.7206 4.1876 7.0539 2.2035 -4.7643
hfenergy: -957.4219513 hartree
pointgroup: C01 [X(C16H16F1N3O1)]
dipole: 0.1637664 1.2335161 1.5043925 debye
polarizability: 225.3119416|1.7952689|197.3597025|26.7593909|1.5948422|161.1937704 unknown
InChI: InChI=1S/C16H16FN3O/c1-18-16-19-15(21)13-4-2-3-5-14(13)20(16)10-11-6-8-12(17)9-7-11/h2-9,16,18-19H,10H2,1H3
charge 0 multiplicity 1
37 atoms
F  5.698247 -0.128384 -1.022287
O  -3.839185 -0.273327 -2.141387
N  -0.635249 0.589396 0.368769
N  -2.350876 1.239769 -1.190225
N  -2.215334 2.25961 1.094694
C  -1.500319 1.696347 -0.065895
C  -1.095076 -0.738256 0.316254
C  0.515508 0.969181 1.202293
C  -2.250651 -1.067799 -0.466556
C  -2.900359 -0.039328 -1.316669
C  1.880907 0.632318 0.595458
C  -0.427703 -1.788882 1.01244
C  -2.73298 -2.397199 -0.505568
C  -0.926149 -3.104695 0.958828
C  -2.936232 3.528199 0.865658
C  -2.088205 -3.421465 0.210975
C  3.025013 0.600639 1.432604
C  2.037686 0.395342 -0.791409
C  4.309333 0.349991 0.902306
C  3.312339 0.139046 -1.343773
C  4.420594 0.126267 -0.480936
H  -0.868771 2.518879 -0.45807
H  0.432347 0.513193 2.209898
H  0.437967 2.05882 1.372332
H  -2.755189 1.955795 -1.799092
H  -2.778406 1.548426 1.580639
H  0.485032 -1.587133 1.578692
H  -3.61196 -2.591703 -1.129557
H  -0.39728 -3.893853 1.50565
H  -3.79347 3.453545 0.158866
H  -2.23024 4.283043 0.470603
H  -3.320893 3.90932 1.826855
H  -2.465115 -4.448281 0.178928
H  2.91738 0.774015 2.510601
H  1.154097 0.397175 -1.438154
H  5.200377 0.322102 1.536123
H  3.447614 -0.051512 -2.412389
