program: Gaussian 09
title: 000072930
version: EM64L-G09RevD.01
frameworkgroup: C1[X(C6H6N2O2)]
method: RPBEPBE
basis: SDD
operation: Freq
keyword: #pfreq=noraman
keyword: PBEPBE/SDD
title: #p freq=noraman PBEPBE/SDD
converged: NO YES NO YES
title: Mulliken charges:
elementType: O O N N C C C C C C H H H H H H
charge: -0.439111 -0.309313 -0.057863 -0.624198 0.113590 0.074921 -0.240392 -0.198783 -0.310154 0.148073 0.278822 0.234464 0.239709 0.327107 0.377449 0.385680
chargesum: 0.00000
title: Mulliken charges with hydrogens summed into heavy atoms:
elementType: O O N N C C C C C C
charge: -0.053430 -0.309313 -0.057863 0.080357 0.113590 0.074921 0.038430 0.035681 -0.070445 0.148073
polarizability: 1.20129634e+02 4.78671640e+00 1.03288268e+02 -4.12970952e-03 3.74393055e-03 3.47818651e+01
1716.lowfreq: -6.9058 -6.7861 -0.0007 0.0002 0.0004 9.7861 95.4209 132.3023 226.4012
frequency: 95.4203 132.3019 226.4011 232.0211 354.3317 408.0833 418.8302 491.4946 519.9765 557.9832 568.1848 591.5809 612.1557 694.7982 713.5549 727.6955 780.2621 816.3614 877.5884 956.6474 971.7806 984.8477 1011.3102 1069.7490 1130.8497 1166.3573 1281.3051 1329.4830 1344.4964 1353.5182 1436.4070 1466.5515 1525.1486 1575.9803 1606.4806 1628.0089 3128.1030 3165.3962 3185.6908 3434.9660 3533.8998 3645.9146
redmass: 7.9865 5.8176 4.6758 5.7602 5.0073 5.9570 3.5373 4.4944 2.3057 7.3078 1.2376 1.2571 5.1316 3.4901 5.4386 1.2508 1.9914 2.4048 5.8735 1.4157 3.5036 1.3666 2.7843 2.1015 1.3357 1.5173 1.6097 2.9372 4.2411 2.4852 2.4193 2.7797 3.2150 5.1265 2.0039 6.5796 1.0902 1.0901 1.0995 1.0517 1.0642 1.0991
irintensity: 0.0001 0.3565 11.8603 0.3938 18.6355 1.7829 12.5380 7.1332 25.4168 2.5852 18.2228 278.0963 36.7270 0.7860 8.1634 114.7882 96.9097 0.6024 6.7155 0.0099 43.9868 0.8540 252.1097 7.6310 83.7672 72.8012 6.4900 110.5726 19.1481 33.0781 19.3387 19.8014 139.2103 146.0362 220.6052 404.3070 20.9462 5.0506 11.2978 98.0148 55.7501 82.3458
temp: 298.150 k
press: 1.00000 atm
elementType: 8 8 7 7 6 6 6 6 6 6 1 1 1 1 1 1
symmnumber: 1
zpe: 309545.2 jmol-1
zpe.correction: 0.117900 hartree
zpe.thermalcorrener: 0.126089 hartree
zpe.thermalcorrenthalpy: 0.127034 hartree
zpe.thermalcorrgfe: 0.084895 hartree
zpe.sumelectzpe: -491.495081 hartree
zpe.sumelectthermal: -491.486891 hartree
zpe.sumelectthermalent: -491.485947 hartree
zpe.sumelectthermalfe: -491.528085 hartree
dipole: 0.2961 -1.1146 0.0002
dipole: 1.1533
quadrupole: -53.1386 -50.8048 -60.3875
quadrupole: 0.1059 0.0078 0.0086
quadrupole: 1.6384 3.9721 -5.6105 0.1059 0.0078 0.0086
hfenergy: -491.6129806 hartree
pointgroup: C01 [X(C6H6N2O2)]
dipole: -0.0909443 0.4434522 -0.0310461 debye
dipolederiv: -0.6655677 0.4901039 -0.0341993 0.6841495 -1.0485212 0.0449011 -0.0469458 0.0436958 -0.4305251 -1.0487119 -0.2121346 0.0118005 -0.3004998 -0.7568836 0.0257079 0.0185101 0.0265155 -0.3602928 -0.4506427 -0.6347436 0.0437105 0.0109232 -0.625069 0.0245256 -0.0013982 0.0223589 -0.275231 -0.3792008 -0.5250092 0.0375952 -0.3005029 -1.1841463 0.0359198 0.0219692 0.0357036 -0.6573697 -1.0254432 0.34536 -0.0276032 -0.3705176 -0.4438043 0.0276702 0.0221162 0.0301204 -0.0288076 0.4181409 0.6958844 -0.0477953 0.3168276 1.2522854 -0.0732276 -0.0216468 -0.0720051 0.1935532 0.6680194 -0.0976666 0.0094195 0.3960988 0.109913 -0.0108677 -0.0248033 -0.0125404 -0.066279 -0.6596306 0.2480564 -0.0190516 0.3817759 -0.2545114 0.0056828 -0.0284094 0.00505 -0.1918939 0.4289044 0.1300443 -0.0073701 -0.3764022 0.6773354 -0.0508545 0.0281074 -0.0490908 -0.0295804 2.0467422 -0.3274876 0.0291254 -0.2491247 1.3197021 -0.0739738 0.0227845 -0.0744196 0.2453257 0.1065594 0.0631219 -0.0045494 0.0438456 0.0218198 0.0089722 -0.003261 0.0089888 0.1478224 0.0199719 -0.082471 0.0052137 -0.0999025 -0.0398828 0.0152111 0.0064909 0.0153666 0.1816635 -0.1324294 -0.0196974 0.0004471 0.0004837 0.0927319 0.0020589 -0.0010897 0.0019392 0.1219869 0.1721071 0.0218594 -0.0021767 0.0134576 0.2778473 0.0066786 -0.0015654 0.0065628 0.3725539 0.3023726 -0.0070085 0.0001744 0.0120153 0.2909178 0.0060325 -0.0010366 0.0057697 0.3759463 0.1988083 -0.0882118 0.0052592 -0.1626274 0.3102656 0.0055628 0.0101779 0.0059844 0.4011277 unknown
polarizability: 120.6248203|3.7945906|102.4669872|0.0403563|-4.6903181|35.1079599 unknown
InChI: InChI=1S/C6H6N2O2/c7-5-4(6(9)10)2-1-3-8-5/h1-3,9H,7H2
charge 0 multiplicity 1
16 atoms
O  -2.349609 1.599271 -0.086494
O  -2.56555 -0.703114 0.069729
N  1.752136 -1.02333 0.108835
N  -0.277108 -2.169046 0.181618
C  -0.338812 0.289198 0.009739
C  0.372656 -0.968425 0.099775
C  0.426159 1.48289 -0.070669
C  1.829924 1.422067 -0.061397
C  2.438486 0.141726 0.0299
C  -1.803845 0.309764 0.002851
H  -0.10288 2.437485 -0.138848
H  2.443354 2.324424 -0.122406
H  3.530902 0.04447 0.040755
H  0.290627 -3.01226 0.242191
H  -1.302454 -2.180256 0.178725
H  -3.340887 1.520637 -0.084804
