program: Gaussian 09
title: 000060882
version: EM64L-G09RevD.01
frameworkgroup: C1[X(C18H25NO2)]
method: RPBEPBE
basis: SDD
operation: Freq
keyword: #p
keyword: freq=noraman
keyword: PBEPBE/SDD
title: #p freq=noraman PBEPBE/SDD
converged: NO YES NO NO
title: Mulliken charges:
elementType: O O N C C C C C C C C C C C C C C C C C C H H H H H H H H H H H H H H H H H H H H H H H H H
charge: -0.282127 -0.439180 -0.062012 0.185253 -0.149374 -0.121457 -0.149445 -0.465074 -0.375847 -0.418348 -0.620619 -0.515088 -0.497152 0.318309 0.291164 -0.787179 -0.531421 -0.374906 0.268793 -0.530279 -0.426276 0.250644 0.210342 0.247629 0.239958 0.195240 0.162739 0.210068 0.201683 0.208128 0.224973 0.221465 0.241407 0.220219 0.226120 0.235418 0.203620 0.213647 0.264756 0.257095 0.231297 0.221568 0.194904 0.229052 0.218343 0.351952
chargesum: 0.00000
title: Mulliken charges with hydrogens summed into heavy atoms:
elementType: O O N C C C C C C C C C C C C C C C C C C
charge: -0.282127 -0.087227 -0.062012 0.185253 0.101270 0.088884 0.098184 -0.029876 -0.003041 -0.008537 -0.174181 -0.053461 -0.035615 0.318309 0.291164 -0.105156 -0.274326 -0.143609 0.268793 0.115246 -0.207933
chargesum: -0.00002
polarizability: 2.51041405e+02 -6.47914248e+00 1.98660493e+02 8.83005174e+00 1.05019881e+01 1.53141691e+02
1716.lowfreq: -11.7615 -0.6749 -0.1634 -0.0256 7.4284 10.2184 25.2276 45.0107 65.4597
frequency: 24.9038 44.6108 65.4027 71.2105 93.3507 106.3717 142.4183 154.1045 190.5790 198.4162 209.6380 229.6883 241.2116 249.9624 267.0212 289.3603 298.5779 312.5544 319.8740 339.1333 343.4265 367.0424 385.4055 396.4401 424.2473 440.2475 467.8995 474.0415 507.0755 532.0966 594.5209 620.5148 646.0371 693.9734 697.1041 706.8848 733.9969 767.7852 781.1970 790.8907 796.8574 807.2460 817.1220 871.7716 878.5001 883.8364 898.8685 914.8494 927.5748 935.4425 937.1773 974.5369 976.7691 1002.6083 1023.4427 1032.4701 1039.5578 1051.1639 1060.9281 1065.0599 1072.4551 1108.1706 1115.1190 1116.8394 1121.7577 1128.9734 1147.9854 1149.2481 1155.2900 1161.4083 1166.3528 1186.6054 1196.8482 1202.6721 1205.2087 1214.1907 1235.6179 1237.3450 1245.7783 1266.8424 1275.0004 1279.2272 1313.7358 1324.0237 1338.7857 1342.3318 1354.8185 1361.5593 1377.5298 1382.8321 1386.2633 1401.1563 1432.8515 1435.6899 1437.0349 1443.0921 1450.3160 1457.9741 1465.1623 1471.6961 1473.2555 1483.8078 1485.3077 1492.3441 1493.3161 1586.8757 1629.1236 2811.2542 2872.0768 2907.4107 2925.6964 2953.9319 2983.1029 2993.7082 2995.1740 3006.2938 3008.2488 3009.2528 3029.0073 3067.2835 3072.4118 3082.8429 3090.6225 3094.2693 3102.9909 3105.9067 3114.2408 3129.8030 3168.9311 3181.6786 3201.9709 3583.0814
redmass: 4.0433 3.7576 3.2197 2.7864 3.8425 3.3159 2.7170 3.1121 3.3667 1.7164 1.6855 1.8181 2.4804 2.5754 2.1430 2.4220 2.4716 4.2309 3.2345 1.1433 2.8084 3.1414 3.0680 2.8062 3.1778 3.3445 2.9710 5.1148 3.7637 2.9898 3.9748 3.8629 3.8841 4.0662 4.5885 3.3977 3.5375 1.2176 2.7057 1.4928 1.9183 2.7651 1.4590 2.0788 2.0252 1.6033 1.9190 3.7617 1.5206 2.6865 2.3499 2.2660 2.1148 2.7801 1.5829 1.2597 2.0648 2.2849 4.6958 1.3688 2.1850 1.1676 1.6826 1.5222 2.0883 2.0996 1.3492 1.6752 2.0382 1.5596 1.4462 1.7883 1.9825 1.7112 2.1044 1.6236 1.5391 1.4751 1.4871 2.2205 1.6090 1.5209 1.4172 1.4463 1.3261 1.4885 1.4968 1.4221 1.6669 2.9982 1.3545 1.5805 1.1389 1.6393 1.0937 1.2616 1.2779 1.0603 1.2920 1.1098 1.1245 1.0516 1.1656 1.8474 1.2202 7.1794 6.5318 1.0708 1.0706 1.0823 1.0366 1.0639 1.0371 1.0786 1.0735 1.0954 1.0988 1.0811 1.0846 1.1019 1.0994 1.0524 1.0976 1.0607 1.0978 1.0866 1.0909 1.0970 1.0905 1.1164 1.1144 1.0660
irintensity: 0.0675 0.1081 2.2034 1.1089 0.2276 0.7612 1.7868 4.5173 0.5648 0.8497 0.3060 2.0468 4.0583 2.6404 3.2241 3.9062 2.8719 0.0914 1.4484 139.2505 0.3746 4.9469 1.7283 0.8706 8.4187 3.7843 8.4641 2.9244 0.3559 8.4143 1.5911 3.5103 9.8195 5.4125 0.7266 9.9913 3.8615 5.5252 7.6589 31.2692 4.1351 4.8554 20.3882 4.5165 4.3389 14.0018 13.2220 63.2970 3.2520 24.2292 2.7470 15.0379 11.7071 7.3729 10.4865 29.7828 6.5581 16.6638 102.9728 17.1650 7.5437 14.4980 1.9426 4.7804 70.5815 25.9240 113.5168 10.8119 23.5216 15.8189 0.6521 26.9673 8.9711 9.0417 7.9061 3.2735 1.2698 0.8964 5.5024 12.7128 19.0404 40.1897 9.3915 15.4427 8.8323 12.5632 14.5678 1.2428 28.0963 12.5071 21.7503 4.1395 1.8701 8.5842 7.3070 2.2561 7.4181 6.2206 3.5386 8.7723 6.2290 14.9135 15.3688 61.0484 32.9819 30.0250 50.6546 84.8258 96.5778 55.6773 82.5231 32.0855 29.0877 21.2799 33.5834 11.2407 80.4268 67.6868 32.5409 23.3435 33.9338 24.7634 37.8637 17.0892 16.9017 15.8644 10.3235 26.0422 4.2929 1.6940 35.7798 35.7345
temp: 298.150 k
press: 1.00000 atm
elementType: 8 8 7 6 6 6 6 6 6 6 6 6 6 6 6 6 6 6 6 6 6 1 1 1 1 1 1 1 1 1 1 1 1 1 1 1 1 1 1 1 1 1 1 1 1 1
symmnumber: 1
zpe: 1031276.8 jmol-1
zpe.correction: 0.392793 hartree
zpe.thermalcorrener: 0.412889 hartree
zpe.thermalcorrenthalpy: 0.413834 hartree
zpe.thermalcorrgfe: 0.345020 hartree
zpe.sumelectzpe: -904.452298 hartree
zpe.sumelectthermal: -904.432201 hartree
zpe.sumelectthermalent: -904.431257 hartree
zpe.sumelectthermalfe: -904.500070 hartree
dipole: -1.1069 -2.5792 -1.3290
dipole: 3.1055
quadrupole: -119.9901 -122.1572 -125.2185
quadrupole: -10.5349 0.9733 -0.7740
quadrupole: 2.4651 0.2981 -2.7632 -10.5349 0.9733 -0.7740
hfenergy: -904.8450903 hartree
pointgroup: C01 [X(C18H25N1O2)]
dipole: -0.4115792 -1.0561758 -0.4559253 debye
polarizability: 250.7132802|-5.3067831|199.8181761|11.4446647|7.0326028|152.3121324 unknown
InChI: InChI=1S/C18H25NO2/c1-18-7-8-19(11-12-3-4-12)16(17(18)21-2)9-13-5-6-14(20)10-15(13)18/h5-6,10,12,16-17,20H,3-4,7-9,11H2,1-2H3
charge 0 multiplicity 1
46 atoms
O  -1.131403 2.617876 -0.681098
O  5.282336 -0.729656 0.525355
N  -1.651078 0.096037 0.850483
C  0.858995 1.473755 0.11495
C  -1.167108 0.091806 -0.551782
C  -0.361047 1.379572 -0.847854
C  -3.922525 -0.860219 0.374665
C  0.292863 1.476621 1.575368
C  -2.636514 -0.952743 1.187627
C  -0.586333 0.246346 1.871243
C  -0.276132 -1.120277 -0.969793
C  -4.906511 -2.038071 0.397527
C  -4.134196 -1.713175 -0.890094
C  1.743269 0.224584 -0.084128
C  1.188543 -1.002373 -0.558193
C  1.630858 2.790474 -0.146442
C  3.113298 0.266934 0.268007
C  2.027556 -2.137348 -0.671197
C  3.930357 -0.875372 0.150617
C  -2.331453 2.692832 -1.503239
C  3.392877 -2.094305 -0.32435
H  -2.065891 0.06788 -1.193049
H  -0.004778 1.323347 -1.904688
H  -4.360786 0.145129 0.368107
H  -0.311296 2.393036 1.700078
H  1.134493 1.508505 2.293494
H  -2.225353 -1.994032 1.090863
H  -2.886599 -0.821274 2.259599
H  0.054774 -0.666605 1.950123
H  -1.076276 0.379197 2.855384
H  -0.33562 -1.225611 -2.073713
H  -0.709732 -2.052587 -0.556767
H  -5.977866 -1.821193 0.430759
H  -4.612356 -2.934573 0.953853
H  -3.329093 -2.396067 -1.183047
H  -4.685966 -1.279846 -1.729892
H  2.388795 2.979495 0.634772
H  2.144537 2.766154 -1.125326
H  0.920461 3.632739 -0.144976
H  3.574949 1.187197 0.635317
H  1.600215 -3.079442 -1.037415
H  -3.125308 2.010928 -1.13664
H  -2.113061 2.459869 -2.568647
H  -2.686325 3.733512 -1.424401
H  4.02149 -2.989364 -0.419035
H  5.77134 -1.580991 0.404877
