program: Gaussian 09
title: 000060885
version: EM64L-G09RevD.01
frameworkgroup: C1[X(C21H27N3O5S)]
method: RPBEPBE
basis: SDD
operation: Freq
keyword: #p
keyword: freq=noraman
keyword: PBEPBE/SDD
title: #p freq=noraman PBEPBE/SDD
converged: YES YES NO NO
title: Mulliken charges:
elementType: S O O O O O N N N C C C C C C C C C C C C C C C C C C C C C H H H H H H H H H H H H H H H H H H H H H H H H H H H
charge: 0.190699 -0.195070 -0.265949 -0.235819 -0.205537 -0.232280 -0.110846 -0.190149 -0.431921 -0.465184 -0.173599 -0.110852 -0.152942 0.145957 0.287291 0.186381 -0.362952 -0.694795 -0.666062 0.238589 -0.682320 -0.690206 0.450938 -0.385054 -0.395486 -0.205512 -0.232515 -0.228200 -0.241304 -0.498077 0.349689 0.262706 0.282989 0.247999 0.266782 0.227374 0.252936 0.233805 0.221659 0.241061 0.259901 0.211176 0.243555 0.239439 0.225446 0.201686 0.244737 0.241321 0.269445 0.223557 0.240286 0.223713 0.221662 0.225361 0.224751 0.234906 0.234835
chargesum: 0.00000
title: Mulliken charges with hydrogens summed into heavy atoms:
elementType: S O O O O O N N N C C C C C C C C C C C C C C C C C C C C C
charge: 0.190699 -0.195070 -0.265949 -0.235819 -0.205537 -0.232280 -0.110846 -0.190149 -0.165138 -0.115495 0.089107 0.172137 -0.152942 0.145957 0.287291 0.186381 -0.114952 0.019321 0.056559 0.238589 0.011850 -0.018337 0.450938 -0.143733 -0.126041 0.258331 -0.008802 -0.006537 -0.015943 0.196415
polarizability: 3.19030219e+02 4.73676747e+00 2.80000413e+02 1.32323617e+01 5.72738062e-01 2.34658358e+02
1716.lowfreq: -6.7255 -5.3253 -0.0018 -0.0015 0.0010 3.9312 10.8315 14.6540 18.0968
frequency: 10.2654 14.3659 17.8370 21.3788 28.7898 37.9021 45.2004 54.0284 74.3116 84.4810 90.1935 100.1964 110.2653 127.2754 133.3689 162.5823 174.3669 181.5378 194.8353 210.8794 212.9805 220.5127 236.7918 244.6658 246.7314 253.7424 270.5234 281.7833 287.2121 291.3079 321.7181 335.9389 344.3870 353.9988 378.7899 397.7297 398.5628 406.2594 423.8250 457.6153 472.4920 474.5115 502.1223 507.7243 518.9751 543.1251 548.4929 563.1237 600.6070 614.8616 618.2959 643.8178 668.4187 706.7958 711.7415 721.3829 729.7554 750.6911 765.1894 784.9032 824.0642 831.6162 838.6248 847.9669 855.8301 857.9024 894.2069 898.6948 909.9423 931.7738 937.4187 941.8076 946.0666 974.8263 981.2939 983.0012 988.4047 990.5998 1000.0216 1007.1387 1023.3055 1038.2873 1040.0581 1064.6239 1069.2847 1088.6648 1100.0116 1113.4561 1121.0526 1125.4296 1133.2743 1141.4471 1167.2731 1170.5463 1173.2884 1176.3985 1179.0140 1181.3257 1190.2780 1203.6182 1206.8643 1217.3755 1230.5992 1248.9864 1269.5611 1280.3965 1291.2737 1302.1337 1332.9569 1338.7435 1353.3310 1372.2670 1379.6030 1380.4277 1383.5471 1385.8584 1393.3505 1400.0147 1407.2263 1431.3604 1439.4748 1450.0849 1450.2036 1455.0467 1460.0997 1462.5198 1462.8346 1469.9563 1472.8892 1478.6131 1478.7257 1479.5240 1480.0699 1595.8871 1612.4022 1640.5279 1658.6090 1723.7955 2891.6137 2979.1589 2980.3886 2981.4045 2987.6455 2987.9223 3002.2535 3014.5029 3054.7719 3074.9616 3075.8967 3076.2489 3083.5608 3087.6631 3090.0639 3092.8669 3105.2412 3109.0357 3120.6795 3123.5192 3127.1723 3128.4618 3140.8159 3148.0521 3152.2938 3163.3322 3507.7394
redmass: 5.0920 3.7171 4.7130 5.1038 4.9367 5.6551 4.2158 4.2152 5.7284 3.4239 6.6638 7.1477 2.9046 2.8947 4.2007 4.6431 2.9642 2.3990 4.6050 4.3682 2.8078 1.2133 1.8063 2.9602 1.5860 1.1127 4.4984 3.5448 3.8845 1.2431 3.2033 3.1333 4.4630 2.8748 3.2805 2.6836 4.5178 2.9732 5.3494 3.4033 3.2010 3.8187 3.0659 4.7008 5.4458 5.1849 3.6807 4.7575 4.8130 6.2038 5.3620 5.2480 4.4132 1.8531 4.8364 6.8125 4.1479 2.2990 5.4727 8.8058 3.9575 4.1640 4.3624 5.8078 5.4563 1.2577 3.8859 2.1662 1.8818 1.8060 1.9344 2.3160 1.5126 4.0627 2.6654 1.4301 1.6172 4.6127 1.3155 1.3337 2.2700 3.3854 3.0110 2.3667 1.7494 2.1381 2.2016 1.2839 2.1828 1.7770 2.9463 1.7008 1.1223 1.8188 1.5977 1.7456 1.3358 2.1376 1.6327 2.3901 2.4823 1.8747 2.3077 2.1148 1.7165 1.1093 1.5165 5.2585 1.4119 1.4749 2.7163 1.6882 1.2230 1.4454 1.1977 3.9226 1.4401 1.1956 1.3516 1.0926 2.1688 1.0882 1.0513 1.0894 1.0493 1.0604 1.0519 1.0508 1.0598 1.1236 1.0492 1.0530 2.0757 6.2895 6.2193 11.3162 9.9199 12.5369 1.0807 1.0367 1.0328 1.0356 1.0354 1.0365 1.0633 1.0839 1.0837 1.0962 1.1031 1.0991 1.0986 1.0996 1.1007 1.1006 1.1005 1.1008 1.0844 1.0900 1.1026 1.0881 1.0928 1.1038 1.0952 1.1011 1.0766
irintensity: 0.2233 0.2528 0.8815 1.1145 0.5842 0.4428 0.4124 1.4704 2.9339 3.0127 3.2814 1.4345 0.7672 5.4115 3.4833 0.1597 2.5793 7.4883 2.1009 2.2500 2.3097 0.4220 0.7235 1.9045 3.0292 0.2646 1.7829 2.2392 3.2869 1.2475 3.4795 3.2679 0.9593 4.4013 6.0226 9.4849 22.8684 0.2107 14.1749 9.8134 3.9069 6.5438 37.2262 4.4795 21.1356 10.9345 34.1107 10.4412 13.8569 0.4588 5.6606 7.5133 34.2689 57.7728 3.1438 27.0908 8.6184 11.8791 75.1599 202.8469 9.4149 3.3941 2.3440 37.7767 46.2513 0.8158 103.0323 28.9160 5.1505 0.9017 1.4590 6.9843 6.3576 17.7315 25.9551 3.0389 3.3862 0.6008 0.9980 2.2399 9.5429 21.4774 178.2423 53.7620 10.2532 122.4700 6.1123 10.4392 21.7618 45.1553 73.7644 41.7725 8.0144 53.9674 4.5374 27.5750 2.8988 31.2209 43.6851 36.5315 25.3456 21.9238 38.2114 26.7707 16.1383 5.0719 17.3813 101.6623 15.3912 24.7988 215.2987 92.2559 19.7197 69.9193 30.7382 18.5586 48.9763 16.0498 5.3658 2.8401 13.6658 26.7634 2.3702 0.9118 1.1760 1.2623 8.1534 6.9972 11.7205 7.0773 12.0022 17.5016 16.0628 0.4781 10.4044 158.5837 152.9846 408.0456 31.3726 36.4089 17.3502 12.5576 17.9583 20.0670 41.6546 8.0007 2.8820 12.3834 47.7331 2.0357 63.2028 11.1688 21.1420 15.5750 16.7525 23.6133 1.3814 0.8814 31.1951 5.2122 24.4495 11.1471 24.1122 28.2575 2.5408
temp: 298.150 k
press: 1.00000 atm
elementType: 16 8 8 8 8 8 7 7 7 6 6 6 6 6 6 6 6 6 6 6 6 6 6 6 6 6 6 6 6 6 1 1 1 1 1 1 1 1 1 1 1 1 1 1 1 1 1 1 1 1 1 1 1 1 1 1 1
symmnumber: 1
zpe: 1189042.7 jmol-1
zpe.correction: 0.452882 hartree
zpe.thermalcorrener: 0.483798 hartree
zpe.thermalcorrenthalpy: 0.484742 hartree
zpe.thermalcorrgfe: 0.386409 hartree
zpe.sumelectzpe: -1752.591251 hartree
zpe.sumelectthermal: -1752.560335 hartree
zpe.sumelectthermalent: -1752.559391 hartree
zpe.sumelectthermalfe: -1752.657724 hartree
dipole: 0.2845 -1.9779 1.2618
dipole: 2.3633
quadrupole: -166.9108 -172.9246 -186.4386
quadrupole: -13.3448 -3.6880 -0.5803
quadrupole: 8.5139 2.5001 -11.0139 -13.3448 -3.6880 -0.5803
hfenergy: -1753.044133 hartree
pointgroup: C01 [X(C21H27N3O5S1)]
dipole: 0.1042711 0.7487149 -0.5413352 debye
polarizability: 318.3662067|-5.7185501|279.9846978|-14.7772094|-1.7543042|235.3380852 unknown
InChI: InChI=1S/C21H27N3O5S/c1-20(2)15(19(27)29-11-28-5)23-17(26)14(18(23)30-20)24-16(25)13(22-21(24,3)4)12-9-7-6-8-10-12/h6-10,13-15,18,22H,11H2,1-5H3
charge 0 multiplicity 1
57 atoms
S  -1.667954 1.432863 -2.473173
O  -1.029546 2.208445 2.019856
O  -5.224971 0.097171 0.686915
O  1.245712 -0.995876 0.511283
O  -3.386628 -1.281967 1.146117
O  -6.776804 -1.795731 0.688653
N  -1.670872 0.824819 0.126324
N  1.622732 1.29104 0.061916
N  3.903964 1.403581 0.322747
C  -0.709502 0.711674 -0.99803
C  0.256268 1.674241 -0.210739
C  -3.10726 0.839872 -0.134378
C  -3.303907 0.688308 -1.709006
C  -0.854945 1.653866 0.919268
C  2.719106 2.303124 0.197951
C  2.002767 0.008008 0.438851
C  3.517146 0.049921 0.764498
C  -4.494465 1.525006 -2.20599
C  -3.413942 -0.786997 -2.149328
C  -3.866217 -0.251015 0.639149
C  2.484221 3.171782 1.465156
C  2.857096 3.179073 -1.065164
C  4.294402 -1.081402 0.0890
C  4.245512 -2.38529 0.640954
C  5.037511 -0.854004 -1.092926
C  -6.146728 -0.805738 1.481613
C  4.931219 -3.450011 0.016004
C  5.728204 -1.918253 -1.715662
C  5.677345 -3.219308 -1.163803
C  -5.99042 -3.023137 0.447318
H  -0.336885 -0.29924 -1.201254
H  0.245131 2.675687 -0.673278
H  -3.530177 1.812938 0.180898
H  3.588269 -0.09516 1.868676
H  4.693174 1.823986 0.822718
H  -4.617738 1.417047 -3.297965
H  -5.421639 1.176098 -1.716186
H  -4.3577 2.595878 -1.975021
H  -4.370861 -1.220586 -1.799227
H  -3.395236 -0.849906 -3.24984
H  -2.586438 -1.399948 -1.752447
H  3.301459 3.90819 1.578175
H  1.530267 3.725905 1.408267
H  2.446052 2.536268 2.367341
H  3.783929 3.774973 -0.991414
H  2.016452 3.887963 -1.180987
H  2.928234 2.539547 -1.960148
H  3.656626 -2.568299 1.547412
H  5.064897 0.161109 -1.502531
H  -5.55121 -1.231994 2.312617
H  -6.932825 -0.113826 1.810531
H  4.884127 -4.456294 0.447346
H  6.304936 -1.733588 -2.629473
H  6.213396 -4.044584 -1.646429
H  -5.539376 -3.395687 1.386147
H  -6.707785 -3.756059 0.049038
H  -5.18582 -2.841981 -0.287339
