program: Gaussian 09
title: 000060880
version: EM64L-G09RevD.01
frameworkgroup: C1[X(C20H18ClN5O2)]
method: RPBEPBE
basis: SDD
operation: Freq
keyword: #p
keyword: freq=noraman
keyword: PBEPBE/SDD
title: #p freq=noraman PBEPBE/SDD
converged: YES YES NO NO
title: Mulliken charges:
elementType: Cl O O N N N N N C C C C C C C C C C C C C C C C C C C C H H H H H H H H H H H H H H H H H H
charge: -0.057994 -0.281475 -0.478603 -0.125868 -0.496522 -0.425080 -0.022081 -0.046097 0.206517 -0.115348 -0.276249 0.279782 -0.733701 -0.708906 0.149829 -0.536456 -0.360717 0.406097 -0.369612 0.294941 -0.276373 0.451523 -0.440054 -0.309547 -0.144015 -0.186537 -0.203199 -0.122983 0.278378 0.232575 0.257334 0.243481 0.232698 0.238953 0.216913 0.235137 0.294040 0.365313 0.261541 0.262309 0.337737 0.413444 0.234543 0.309978 0.257057 0.257297
chargesum: 0.00000
title: Mulliken charges with hydrogens summed into heavy atoms:
elementType: Cl O O N N N N N C C C C C C C C C C C C C C C C C C C C
charge: -0.057994 -0.281475 -0.113290 -0.125868 -0.158785 -0.011636 -0.022081 -0.046097 0.206517 0.163030 -0.043673 0.279782 -0.000188 -0.017903 0.149829 -0.242416 -0.099176 0.406097 -0.107304 0.294941 -0.276373 0.451523 -0.205511 0.000431 -0.144015 0.070520 0.054098 -0.122983
polarizability: 3.51097626e+02 2.61253926e+01 3.30551986e+02 -1.32273964e+01 1.08649438e+01 1.59791603e+02
1716.lowfreq: -4.5261 0.0011 0.0014 0.0017 3.1094 6.3027 17.9956 29.2318 35.4885
frequency: 17.6979 29.2036 35.4688 42.8200 50.9708 63.1349 86.5192 94.8380 111.7204 118.7594 129.4094 150.8928 173.3597 174.5027 192.1076 194.7257 207.5724 222.4322 246.0466 268.9304 295.2454 298.2042 304.1060 321.3107 331.7483 349.9446 373.3296 391.7841 414.7039 418.2614 419.9727 432.8561 443.3784 457.8510 477.5471 486.5490 502.9929 507.7761 537.5325 556.4630 573.0630 576.2535 582.7292 595.0056 615.0848 631.1335 655.8734 667.0161 701.8207 703.4909 717.5373 751.2795 759.4141 815.2611 820.7855 826.3409 842.7803 845.9293 853.1139 875.4123 904.0688 926.2285 930.2727 940.1691 941.0811 942.6671 966.5839 974.9189 983.3122 995.1510 1007.4689 1033.2765 1042.9426 1073.2149 1110.0992 1113.3147 1124.1066 1142.9224 1153.2390 1180.6824 1183.4529 1195.0881 1206.5648 1229.4031 1243.3330 1260.2501 1268.3100 1273.4376 1280.0992 1294.5882 1299.1287 1321.4866 1366.7766 1375.0349 1377.4187 1387.7837 1402.4609 1404.1909 1422.1531 1449.0434 1467.9284 1470.9265 1476.4002 1480.3975 1491.9478 1527.4579 1542.0063 1578.1586 1603.7503 1607.6196 1614.7156 1665.8312 2176.6021 2181.7194 2864.1964 2996.8191 3004.8068 3028.2423 3064.3508 3094.4332 3101.3652 3103.7032 3113.2072 3122.6299 3156.2263 3164.5525 3168.6021 3173.8975 3177.6313 3193.8168 3498.3545 3561.3819
redmass: 9.0210 6.9772 8.1696 5.9051 5.0407 4.8873 8.1486 8.1651 8.6460 5.7698 5.1088 6.0377 6.4780 7.4718 3.2022 1.3088 2.4968 2.2736 1.8510 5.1514 6.2487 6.0322 5.5474 4.3427 4.6727 5.6604 3.9717 3.1029 2.9542 4.3638 1.3015 4.5180 5.1230 6.8236 6.1461 6.1401 3.7697 3.4261 4.7491 5.1107 4.9252 1.5309 4.0427 6.1079 4.5455 6.5100 7.1704 6.3604 5.9550 3.6172 5.0050 5.7639 4.5655 1.4324 2.7022 4.9651 1.8208 1.4134 2.5084 1.8481 2.7066 3.8121 2.3883 1.4415 1.5642 1.5294 1.4388 2.5819 1.3394 3.8500 1.4172 3.3947 5.6028 2.5522 1.7816 1.6993 1.8614 2.0756 2.9201 1.4928 1.1212 2.0670 2.0969 4.8849 2.9318 2.1959 1.7566 1.4513 1.6520 1.2678 1.4918 1.7633 5.0782 2.9612 1.5993 1.2349 1.2050 4.0297 4.9279 1.0541 1.0601 2.0961 1.2273 2.4923 1.0686 1.7198 1.9821 7.4680 3.4275 6.0903 7.0489 3.1149 12.6287 12.2651 1.0795 1.0357 1.0360 1.0882 1.0872 1.0994 1.0998 1.1000 1.1004 1.0904 1.0888 1.0911 1.0924 1.0951 1.0977 1.0949 1.0762 1.0659
irintensity: 0.9964 1.3843 0.3264 0.8556 0.5281 1.8711 1.6048 2.4760 1.6718 4.5649 4.4588 6.9388 0.7588 0.6483 0.9001 0.2366 3.7284 3.0072 1.2708 2.9308 5.4219 5.4845 2.5864 1.0279 1.2532 32.9103 9.7719 0.6043 3.2158 28.1880 73.8054 2.6391 19.8856 7.8077 1.5223 6.0600 8.2294 55.9030 6.4330 6.1693 1.8481 38.1005 7.3560 4.5350 0.5014 0.2995 3.1833 13.8005 8.5767 0.8514 18.9673 8.2778 9.2505 42.1838 25.9336 32.6989 31.0557 15.3518 133.6125 48.4708 6.0799 49.5336 44.0975 2.9292 8.5991 4.8778 4.5140 32.2493 3.4650 30.9775 13.8182 16.1944 12.0555 33.1937 13.3493 45.5096 104.2998 45.7010 26.6157 37.4415 3.4163 45.4374 43.2816 111.1045 42.8749 25.6588 14.3009 7.3818 52.9128 20.5478 23.5994 120.1395 4.7617 77.5848 10.5228 44.3451 21.0874 9.8247 15.1326 9.6735 5.1025 62.6104 19.9201 186.8969 20.1994 330.1948 183.1697 11.4741 79.9880 29.8243 44.8987 743.8197 55.0428 213.2033 30.8598 9.7024 10.1646 935.7708 22.7473 17.5836 17.6385 18.4790 17.7200 10.0574 2.3261 1.8412 0.5515 2.2884 4.8234 12.1328 46.5145 20.8261
temp: 298.150 k
press: 1.00000 atm
elementType: 17 8 8 7 7 7 7 7 6 6 6 6 6 6 6 6 6 6 6 6 6 6 6 6 6 6 6 6 1 1 1 1 1 1 1 1 1 1 1 1 1 1 1 1 1 1
symmnumber: 1
zpe: 906418.8 jmol-1
zpe.correction: 0.345237 hartree
zpe.thermalcorrener: 0.371064 hartree
zpe.thermalcorrenthalpy: 0.372008 hartree
zpe.thermalcorrgfe: 0.288229 hartree
zpe.sumelectzpe: -1655.170300 hartree
zpe.sumelectthermal: -1655.144473 hartree
zpe.sumelectthermalent: -1655.143529 hartree
zpe.sumelectthermalfe: -1655.227308 hartree
dipole: -6.9733 -3.1989 3.2049
dipole: 8.3145
quadrupole: -159.4290 -208.1003 -174.4068
quadrupole: -9.1375 -3.9365 0.4337
quadrupole: 21.2164 -27.4549 6.2386 -9.1375 -3.9365 0.4337
hfenergy: -1655.5155371 hartree
pointgroup: C01 [X(C20H18Cl1N5O2)]
dipole: -2.0059403 2.2624919 -1.2481793 debye
polarizability: 324.9339325|-34.1550386|342.5333413|36.8760424|29.8973935|173.9739418 unknown
InChI: InChI=1S/C20H18ClN5O2/c1-20(2)18(27)17(15-9-12(10-22)3-8-16(15)28-20)26-19(24-11-23)25-14-6-4-13(21)5-7-14/h3-9,17-18,24-25,27H,1-2H3
charge 0 multiplicity 1
46 atoms
Cl 6.034766 -3.487717 -0.839123
O  -3.704044 1.13076 -0.859609
O  -1.549949 3.375447 0.206142
N  0.39719 0.660334 0.127222
N  2.604033 1.223523 0.818489
N  0.847658 2.706656 1.358629
N  -1.323153 -5.15473 0.475785
N  2.411133 4.070314 2.842325
C  -2.70348 2.003646 -1.594715
C  -1.446007 2.200417 -0.703416
C  -1.048178 0.944713 0.170738
C  -1.862293 -0.307674 -0.139057
C  -2.297055 1.312685 -2.914722
C  -3.477014 3.302088 -1.858512
C  -3.209091 -0.152737 -0.555881
C  -1.37903 -1.601344 0.124665
C  -4.079184 -1.257244 -0.670006
C  -2.235364 -2.729389 -0.003678
C  -3.595549 -2.546947 -0.385472
C  1.239307 1.466729 0.72858
C  -1.735607 -4.052507 0.260005
C  3.348193 0.084313 0.405988
C  4.724741 0.057131 0.763824
C  2.799795 -0.990306 -0.342471
C  1.667269 3.433953 2.145262
C  5.544426 -1.023913 0.386837
C  3.620276 -2.077243 -0.715072
C  4.978467 -2.083562 -0.349483
H  -0.597343 2.459367 -1.358367
H  -1.3535 1.235183 1.207547
H  -1.658513 0.428395 -2.749464
H  -3.203593 0.992789 -3.456126
H  -1.741472 2.021489 -3.553738
H  -4.272317 3.11089 -2.598186
H  -3.958421 3.68085 -0.940831
H  -2.804626 4.085676 -2.245518
H  -0.340631 -1.723322 0.445174
H  -2.418668 3.347857 0.682056
H  -5.112526 -1.092283 -0.987998
H  -4.254978 -3.415986 -0.470396
H  3.158256 1.959751 1.265973
H  -0.082634 3.108567 1.080578
H  5.160067 0.880183 1.34428
H  1.747651 -0.955581 -0.627136
H  6.601765 -1.041434 0.665196
H  3.198625 -2.908286 -1.288114
