program: Gaussian 09
title: 000060865
version: EM64L-G09RevD.01
frameworkgroup: C1[X(C21H23NO3)]
method: RPBEPBE
basis: SDD
operation: Freq
keyword: #p
keyword: freq=noraman
keyword: PBEPBE/SDD
title: #p freq=noraman PBEPBE/SDD
converged: YES YES NO NO
title: Mulliken charges:
elementType: O O O N C C C C C C C C C C C C C C C C C C C C C H H H H H H H H H H H H H H H H H H H H H H H
charge: -0.257237 -0.408094 -0.238114 -0.080396 0.197689 0.204884 0.246219 0.300800 0.142736 -0.479562 -0.316703 -0.545101 -0.344687 -0.533409 0.452117 -0.388421 -0.363953 -0.423628 -0.418245 -0.633419 -0.250946 -0.236400 -0.615323 -0.622592 0.212713 0.206365 0.255466 0.240291 0.232952 0.225825 0.179485 0.217871 0.271018 0.248999 0.251389 0.238616 0.238411 0.240319 0.245033 0.230056 0.229982 0.226081 0.187161 0.221117 0.220968 0.187534 0.229366 0.374764
chargesum: 0.00000
title: Mulliken charges with hydrogens summed into heavy atoms:
elementType: O O O N C C C C C C C C C C C C C C C C C C C C C
charge: -0.257237 -0.033330 -0.238114 -0.080396 0.197689 0.204884 0.246219 0.300800 0.142736 -0.017731 -0.076412 -0.086324 0.052670 -0.262391 0.452117 -0.139422 -0.112564 -0.185011 -0.179834 -0.148066 -0.020890 -0.006418 0.019037 0.015276 0.212713
polarizability: 2.96687480e+02 -1.39755453e+01 2.71339295e+02 -1.89743794e+01 -1.82667519e+01 1.86763507e+02
1716.lowfreq: -3.7497 -0.0007 -0.0006 -0.0002 2.8937 7.7332 14.3641 17.9296 29.0703
frequency: 13.4073 17.8759 29.0430 36.6634 38.4191 46.7855 65.8186 90.0407 97.4814 116.8270 135.7346 145.6920 165.9882 195.3994 214.8287 218.9474 233.4627 243.5029 274.8200 312.0929 328.7687 344.3906 352.5429 354.3641 384.4740 395.0531 417.7851 434.9601 441.5049 460.0421 477.1348 481.0699 527.1371 537.3859 542.2986 596.0091 607.5606 622.1146 640.8199 659.1854 688.2241 689.6379 722.0297 754.6868 759.9860 769.9888 779.3804 813.7175 815.0980 829.4449 837.6441 856.1648 871.2819 888.8261 915.6158 928.1541 942.9514 953.1576 955.6510 968.8967 980.5340 990.3302 1014.7206 1020.2483 1033.2120 1038.5570 1056.3135 1063.7531 1088.5509 1093.6315 1114.3032 1117.9301 1135.6446 1150.7052 1160.1850 1173.7825 1178.2860 1192.0122 1206.4599 1223.9015 1226.2837 1231.3416 1252.1686 1260.1135 1268.9701 1275.8184 1285.3209 1296.6135 1304.9955 1323.8363 1346.2382 1360.9181 1366.4110 1375.8031 1382.6516 1411.7544 1419.4997 1441.9827 1443.8507 1452.1247 1453.7012 1461.7827 1462.3530 1466.6471 1475.0674 1479.8114 1480.3550 1482.6031 1486.4963 1573.3296 1583.8120 1611.1264 1613.9974 1633.4385 1660.4944 2820.7730 2844.1912 2860.3575 2957.4130 2988.4645 3018.1437 3018.1944 3019.1361 3029.1899 3057.8392 3076.9998 3080.5859 3085.1804 3093.3918 3101.7648 3121.2973 3130.9784 3134.0464 3141.9158 3146.2317 3163.3304 3166.4189 3505.2613
redmass: 6.2087 4.3780 8.8110 3.4825 3.5292 4.3647 6.3495 3.0324 3.5649 2.7234 4.1172 3.7892 5.6071 3.1236 3.5640 1.3408 1.8866 1.7203 2.4558 4.7477 2.5835 5.2574 5.0289 2.5727 3.2755 2.4899 3.0019 3.3756 3.1845 3.4899 3.3477 3.5404 3.8211 4.0117 3.7690 3.9087 2.6558 3.9576 4.1114 2.5278 3.7708 3.9651 4.1199 3.1377 3.7857 1.5309 1.4250 2.3839 3.2888 2.6467 3.7559 2.6957 1.4343 1.5450 1.6667 1.9970 4.9049 1.5733 1.3669 2.9919 2.0097 1.3287 2.4058 2.2060 1.6896 2.2031 1.9706 2.4690 2.5803 1.3073 2.0622 1.8253 1.5157 1.6169 1.6667 1.0606 1.2521 2.4270 1.6875 1.6832 1.8099 1.6933 1.8744 2.1361 1.4263 1.5609 1.4034 1.4590 1.4788 2.1954 1.6994 1.7269 1.3830 3.7061 4.8097 2.8782 1.1409 1.1721 2.3900 1.0911 1.1131 1.1667 1.0516 1.0645 1.0664 2.4330 1.0965 2.7754 1.0590 7.0569 6.7640 6.6062 6.5878 8.0765 8.4961 1.0700 1.0574 1.0575 1.0664 1.0658 1.0725 1.0635 1.0841 1.0720 1.0933 1.1010 1.0893 1.1002 1.0991 1.1000 1.0868 1.0885 1.0892 1.0910 1.0941 1.1007 1.0956 1.0638
irintensity: 0.9889 0.0129 2.6218 0.7532 0.5585 0.0623 0.7421 0.6177 0.1448 1.7807 0.1610 0.3986 3.7003 0.6165 0.5322 2.0683 0.6557 0.4757 2.9477 0.5894 1.9745 1.3244 1.1709 9.0557 1.7374 3.7229 1.1409 1.8517 3.7574 4.6200 5.3655 1.0771 30.6460 39.2096 3.1168 10.0363 44.3023 40.2048 6.8292 97.5910 3.0308 15.3413 2.7108 35.0003 4.8438 49.6357 2.3252 17.8083 44.4903 12.0811 4.2337 7.0985 17.1671 5.5544 2.5511 28.7421 45.2929 1.6248 4.7470 28.1832 1.3559 0.1833 1.7352 28.6299 28.4414 8.2275 278.1523 44.2850 4.6662 8.1468 17.0998 15.5081 8.6856 13.2434 8.1610 0.5033 33.8970 39.3479 40.8485 67.6149 10.6219 0.8654 5.3014 9.4480 6.2280 5.2879 0.3144 1.7833 13.1544 71.9118 7.5940 9.2112 21.1145 44.1838 3.6024 8.2226 3.9053 3.6500 2.8061 5.3707 19.1583 8.4656 17.0302 5.0755 10.8762 93.5858 25.5435 21.8993 23.5334 1.8750 1.2970 2.0167 6.3063 7.2225 179.5630 66.6807 70.6890 240.2293 15.4925 43.9672 45.4429 4.9047 37.7374 36.8034 11.9294 32.1748 23.2636 60.0586 18.1609 5.2569 5.4657 5.6581 11.8314 2.2253 25.1140 30.0525 9.0755 21.2488
temp: 298.150 k
press: 1.00000 atm
elementType: 8 8 8 7 6 6 6 6 6 6 6 6 6 6 6 6 6 6 6 6 6 6 6 6 6 1 1 1 1 1 1 1 1 1 1 1 1 1 1 1 1 1 1 1 1 1 1 1
symmnumber: 1
zpe: 1024504.9 jmol-1
zpe.correction: 0.390213 hartree
zpe.thermalcorrener: 0.413978 hartree
zpe.thermalcorrenthalpy: 0.414922 hartree
zpe.thermalcorrgfe: 0.333428 hartree
zpe.sumelectzpe: -1092.608670 hartree
zpe.sumelectthermal: -1092.584905 hartree
zpe.sumelectthermalent: -1092.583960 hartree
zpe.sumelectthermalfe: -1092.665454 hartree
dipole: 0.8465 0.7401 0.0787
dipole: 1.1272
quadrupole: -136.6657 -140.8841 -140.4596
quadrupole: -4.4397 -1.5064 1.9396
quadrupole: 2.6708 -1.5477 -1.1231 -4.4397 -1.5064 1.9396
hfenergy: -1092.9988829 hartree
pointgroup: C01[X(C21H23N1O3)]
dipole: 0.2998118 0.325456 0.0291403 debye
polarizability: 300.6017535|-10.7209723|266.5560901|-11.178785|-24.5744926|187.6324386 unknown
InChI: InChI=1S/C21H23NO3/c1-22(2)11-5-8-18-17-7-4-3-6-16(17)14-25-20-10-9-15(12-19(18)20)13-21(23)24/h3-4,6-10,12,23H,5,11,13-14H2,1-2H3
charge 0 multiplicity 1
48 atoms
O  -0.541262 -2.592049 1.644951
O  -5.672735 2.076732 -0.061245
O  -3.67834 2.870629 -0.946823
N  3.766493 3.492409 0.441772
C  0.496191 -0.215958 -0.147908
C  -0.92981 -0.653968 0.049725
C  1.52519 -1.285528 -0.359646
C  1.708735 -2.289714 0.633325
C  -1.355179 -1.762842 0.851169
C  2.156781 1.750562 -0.435194
C  0.801617 1.119981 -0.208583
C  0.87412 -2.20522 1.886463
C  2.420825 2.890468 0.581925
C  -1.946521 0.053069 -0.654548
C  -3.314742 -0.281381 -0.580378
C  2.300646 -1.343852 -1.544449
C  -2.725779 -2.116267 0.920151
C  2.65195 -3.322617 0.433293
C  -3.699487 -1.385812 0.219053
C  -4.355453 0.522205 -1.362573
C  3.245873 -2.37591 -1.738808
C  3.424512 -3.369667 -0.749286
C  4.126894 4.311037 1.618391
C  3.946989 4.243424 -0.817082
C  -4.49223 1.931459 -0.805131
H  2.194531 2.167912 -1.463668
H  2.971492 1.009642 -0.36033
H  -0.019729 1.833312 -0.036558
H  1.206326 -2.924079 2.651803
H  0.886608 -1.181751 2.311044
H  1.607829 3.660268 0.488405
H  2.347042 2.469531 1.602823
H  -1.640709 0.88257 -1.301574
H  2.146208 -0.587251 -2.321346
H  -2.997637 -2.968383 1.550536
H  2.782422 -4.090433 1.205469
H  -4.754485 -1.673111 0.292941
H  -5.336055 0.023314 -1.326671
H  -4.046019 0.620551 -2.419026
H  3.836306 -2.407458 -2.661248
H  4.154549 -4.172577 -0.898834
H  4.063717 3.695846 2.533659
H  3.467884 5.206544 1.756466
H  5.167801 4.667825 1.518148
H  4.975927 4.642855 -0.860763
H  3.236132 5.10396 -0.920767
H  3.81033 3.579681 -1.687554
H  -5.709045 2.99654 0.320081
