program: Gaussian 09
title: 000060848
version: EM64L-G09RevD.01
frameworkgroup: C1[X(C21H25N5O2)]
method: RPBEPBE
basis: SDD
operation: Freq
keyword: #p
keyword: freq=noraman
keyword: PBEPBE/SDD
title: #p freq=noraman PBEPBE/SDD
converged: YES YES NO NO
title: Mulliken charges:
elementType: O O N N N N N C C C C C C C C C C C C C C C C C C C C C H H H H H H H H H H H H H H H H H H H H H H H H H
charge: -0.315911 -0.274599 -0.195586 -0.117104 -0.470373 -0.012855 -0.395847 -0.358995 -0.403968 -0.391972 -0.408960 0.039488 0.109385 0.254817 0.276597 -0.464057 0.294016 0.216687 -0.300502 -0.564076 -0.352426 -0.385576 -0.186525 -0.331101 0.329046 -0.339258 -0.710642 -0.538943 0.228355 0.236055 0.248676 0.233458 0.216817 0.264732 0.241341 0.222317 0.254506 0.337129 0.242880 0.306479 0.261390 0.235251 0.235455 0.220826 0.216671 0.211431 0.239070 0.215411 0.226682 0.227067 0.217955 0.216756 0.242533
chargesum: 0.00000
title: Mulliken charges with hydrogens summed into heavy atoms:
elementType: O O N N N N N C C C C C C C C C C C C C C C C C C C C C
charge: -0.315911 -0.274599 -0.195586 -0.117104 -0.133244 -0.012855 -0.089368 0.105414 0.078167 0.089576 0.054698 0.039488 0.109385 0.254817 0.276597 -0.209551 0.294016 0.216687 -0.057622 -0.302686 -0.117175 -0.150121 0.034301 0.097000 0.329046 -0.100188 -0.041482 0.138300
polarizability: 4.27286388e+02 1.54428290e+01 2.58347861e+02 -1.78299642e+01 6.29530786e+00 2.08927355e+02
1716.lowfreq: -8.4579 -4.1313 -0.0012 -0.0008 0.0007 3.4932 14.3729 20.7906 24.5553
frequency: 14.2313 20.7302 24.5092 46.2918 58.5614 63.5096 76.6033 84.6514 92.3464 116.7047 128.8090 142.5814 162.1676 176.6312 188.3549 220.7978 240.7614 244.8672 252.8075 261.1917 274.6399 283.0811 316.7548 324.1154 342.1238 348.8929 372.5356 377.0202 413.6151 427.8058 435.7526 450.8319 462.4316 488.7834 519.3461 533.8237 559.6122 576.2424 586.8369 597.1513 616.0795 619.4058 625.8489 641.1008 641.7457 667.7054 724.4304 725.4076 728.3415 749.2638 761.8015 788.5263 790.0262 792.5780 802.5004 814.3883 827.9082 839.6661 862.9018 878.1106 878.5664 917.1679 919.3940 921.5369 930.4603 945.2963 949.5007 969.3377 1000.6888 1025.9572 1041.1363 1047.5347 1058.9461 1072.9110 1080.3530 1094.4106 1111.6253 1127.4758 1134.8369 1136.1473 1139.1524 1148.9712 1161.4061 1175.4021 1188.5701 1193.9219 1212.0864 1217.1785 1229.0132 1231.0379 1248.3408 1263.5662 1265.7827 1291.7948 1295.3989 1317.8327 1325.9355 1328.5122 1338.2229 1345.9909 1359.2312 1364.3261 1365.1836 1379.2653 1396.0419 1407.5396 1415.3038 1424.5483 1434.5533 1437.8259 1456.6087 1460.4473 1464.8454 1466.5612 1467.9503 1471.6228 1471.9719 1472.7632 1476.6303 1484.9120 1488.0345 1499.5071 1528.4940 1543.2475 1561.5036 1581.9063 1585.3044 1645.7269 2915.7657 2923.7541 2951.6253 2952.1750 2960.7832 2977.1072 2984.0280 2993.0734 3037.0891 3058.8757 3077.9227 3081.4398 3095.1134 3095.2944 3118.3080 3121.8059 3133.4089 3141.2496 3149.0725 3163.5886 3168.9822 3169.1345 3219.9335 3480.4127 3568.3312
redmass: 4.9506 4.6715 4.9538 3.9851 4.2215 2.8360 4.2698 4.5037 4.8331 2.0918 4.5908 3.6681 3.9635 3.2013 4.9494 3.5556 2.2365 2.0920 1.8414 2.1396 2.3165 4.9918 2.5324 4.0481 3.4268 3.5984 4.6214 5.3388 2.0923 3.1660 4.4981 3.4739 3.2279 3.4345 4.5152 4.2588 4.1235 3.4863 3.6690 4.6216 2.0823 3.9073 3.3878 2.3207 1.3336 3.0561 3.7502 3.8956 6.1099 3.7683 2.4642 1.9062 1.5878 4.4788 1.5679 1.1926 2.8130 1.6828 3.3620 1.5602 1.4639 2.8362 1.3541 4.4665 2.7649 2.0936 1.4915 3.4561 3.5885 2.7864 2.3479 1.8677 2.3367 2.2805 2.0987 2.1219 1.2575 1.5317 1.5061 2.6608 1.7820 1.7093 1.7597 1.7706 2.6481 1.0822 2.2431 1.6744 2.0726 1.6342 1.7549 1.2363 1.3776 2.0324 1.7700 2.4543 2.1639 1.3207 1.6460 1.5582 1.4943 1.5361 2.1616 5.7738 1.2465 3.9023 1.9931 2.3241 2.0641 1.3956 3.3570 1.1115 1.0940 1.0549 1.1418 1.2382 1.2685 1.4656 1.1209 1.2458 2.9235 1.0986 4.8979 7.6484 4.7039 6.0682 6.2957 7.9218 1.0681 1.0700 1.0678 1.0367 1.0694 1.0669 1.0384 1.0907 1.1037 1.0928 1.0997 1.0942 1.0992 1.0947 1.0986 1.0897 1.0863 1.0887 1.0914 1.0925 1.0949 1.0997 1.0975 1.0758 1.0802
irintensity: 0.3048 0.1333 0.9620 2.4487 0.2571 0.6531 0.2300 0.8628 8.2911 0.8650 1.7451 1.6022 4.0048 1.3074 1.5834 3.7327 3.2922 0.2485 3.2549 1.2754 2.0160 3.0221 1.3345 6.1363 6.3168 8.7714 16.3274 7.1888 0.2199 7.6158 6.6872 10.5732 1.1196 5.4599 5.3304 38.4786 6.7746 1.6548 43.4036 1.7548 41.9662 12.4187 6.4169 36.4263 86.0665 1.7662 2.8605 21.2811 9.5245 0.3655 28.2244 52.9440 56.1908 6.8761 13.6711 1.3217 6.4282 0.2094 1.0525 31.2951 14.8385 38.6231 3.1238 0.6240 14.1165 4.5995 2.2246 58.1707 30.5184 73.5897 1.9899 6.9831 1.8637 0.7231 2.1381 0.8986 0.2262 3.9799 9.2364 40.8537 2.7386 85.4346 46.1484 47.2694 120.2326 5.6803 41.0270 181.6197 65.4937 328.1810 75.6922 25.7097 65.5681 19.6787 26.2316 5.1836 42.2777 6.0163 30.9012 7.0702 13.1433 20.0535 5.7069 70.6003 30.5955 276.0068 167.1919 33.2369 6.6328 0.4940 27.4468 15.4443 13.6342 13.5230 38.6183 56.9923 39.2340 108.6208 49.1971 36.1813 1.1324 7.1771 351.7201 159.8162 14.0396 41.8028 110.4135 31.5997 89.4725 32.3852 121.8062 60.8292 24.0377 84.0779 24.1462 29.1638 54.5962 10.6988 40.2573 26.0928 38.4007 5.4049 30.3379 4.6059 2.3061 6.0142 32.7032 4.2710 23.9353 25.5029 6.4480 27.3340 100.5179
temp: 298.150 k
press: 1.00000 atm
elementType: 8 8 7 7 7 7 7 6 6 6 6 6 6 6 6 6 6 6 6 6 6 6 6 6 6 6 6 6 1 1 1 1 1 1 1 1 1 1 1 1 1 1 1 1 1 1 1 1 1 1 1 1 1
symmnumber: 1
zpe: 1137276.4 jmol-1
zpe.correction: 0.433166 hartree
zpe.thermalcorrener: 0.458732 hartree
zpe.thermalcorrenthalpy: 0.459676 hartree
zpe.thermalcorrgfe: 0.375442 hartree
zpe.sumelectzpe: -1237.394971 hartree
zpe.sumelectthermal: -1237.369405 hartree
zpe.sumelectthermalent: -1237.368461 hartree
zpe.sumelectthermalfe: -1237.452694 hartree
dipole: 0.6129 -3.7104 2.9528
dipole: 4.7814
quadrupole: -123.6075 -170.2437 -165.3260
quadrupole: -11.5137 6.3468 -1.3341
quadrupole: 29.4516 -17.1846 -12.2670 -11.5137 6.3468 -1.3341
hfenergy: -1237.8281365 hartree
pointgroup: C01 [X(C21H25N5O2)]
dipole: -0.1871343 1.6658684 0.8535782 debye
polarizability: 428.4691019|14.019102|253.1544021|11.0539271|-15.9208547|212.9380998 unknown
InChI: InChI=1S/C21H25N5O2/c1-3-22-18-5-4-8-23-20(18)25-9-11-26(12-10-25)21(27)19-14-15-13-16(28-2)6-7-17(15)24-19/h4-8,13-14,22,24H,3,9-12H2,1-2H3
charge 0 multiplicity 1
53 atoms
O  1.18961 -2.999144 1.560417
O  6.756863 2.071988 -1.53393
N  -2.894319 -0.491021 0.190636
N  -0.298623 -1.258337 1.131258
N  3.396488 -1.473596 1.157312
N  -4.501511 -1.07877 -1.496058
N  -4.332833 1.838455 0.779087
C  -2.510848 -1.927171 0.253144
C  -1.706771 0.377442 -0.078032
C  -1.465897 -2.138943 1.365772
C  -0.662469 0.167815 1.033956
C  -4.068708 -0.186446 -0.573209
C  0.980283 -1.795178 1.166039
C  2.153644 -0.989225 0.724575
C  -4.776042 1.037166 -0.273623
C  2.375065 0.100687 -0.137958
C  3.802511 0.295306 -0.230619
C  4.421166 -0.716802 0.595327
C  -5.914477 1.337529 -1.065749
C  4.617445 1.217451 -0.933991
C  5.822341 -0.811871 0.724002
C  -5.627745 -0.789431 -2.217658
C  -6.336313 0.417083 -2.054685
C  -5.07977 3.009669 1.256161
C  6.016108 1.117401 -0.803708
C  6.618228 0.111158 0.017378
C  -4.361277 3.659386 2.450253
C  8.214956 2.011854 -1.449164
H  -2.103896 -2.274622 -0.719886
H  -3.41551 -2.522015 0.46052
H  -2.026097 1.433532 -0.105912
H  -1.257615 0.121306 -1.064325
H  -1.914895 -1.902147 2.352049
H  -1.107781 -3.180494 1.385206
H  0.231674 0.782102 0.865274
H  -1.111495 0.479158 2.002059
H  1.621601 0.66219 -0.686422
H  3.462758 -2.336644 1.699276
H  -6.485496 2.254324 -0.890595
H  -3.725655 1.353972 1.448838
H  4.196053 1.999391 -1.572314
H  6.289984 -1.57887 1.350125
H  -5.944373 -1.548073 -2.941058
H  -7.216397 0.627496 -2.67084
H  -5.165081 3.745033 0.43121
H  -6.118948 2.731639 1.54662
H  7.70658 0.046932 0.105056
H  -4.277076 2.954102 3.298577
H  -3.344656 3.986898 2.16771
H  -4.922017 4.542161 2.802848
H  8.606519 1.047532 -1.829631
H  8.570722 2.171288 -0.41178
H  8.572994 2.831652 -2.089839
