program: Gaussian 09
title: 000007312
version: EM64L-G09RevD.01
frameworkgroup: C1[X(C8H18ClN)]
method: RPBEPBE
basis: SDD
operation: Freq
keyword: #p
keyword: freq=noraman
keyword: PBEPBE/SDD
title: #p freq=noraman PBEPBE/SDD
converged: YES YES NO NO
title: Mulliken charges:
elementType: Cl N C C C C C C C C H H H H H H H H H H H H H H H H H H
charge: -0.099782 -0.129060 -0.049434 -0.028179 -0.328571 -0.685856 -0.680810 -0.695674 -0.690959 -0.580268 0.201886 0.198849 0.227867 0.223033 0.212681 0.210219 0.218617 0.227729 0.210519 0.202922 0.214056 0.205470 0.237671 0.227078 0.206288 0.210351 0.274077 0.259279
chargesum: 0.00000
title: Mulliken charges with hydrogens summed into heavy atoms:
elementType: Cl N C C C C C C C C
charge: -0.099782 -0.129060 0.152452 0.170669 0.122329 -0.044339 -0.039639 -0.038477 -0.047242 -0.046912
polarizability: 1.27551588e+02 4.58700281e-01 1.00706801e+02 -2.97955191e+00 6.49042967e-02 9.18919414e+01
1716.lowfreq: -17.0622 -10.5127 -8.4211 -0.0020 -0.0014 0.0013 36.6562 43.9415 70.4674
frequency: 36.4998 43.8917 70.3773 92.9932 117.3491 172.2009 181.1090 214.4780 232.0848 234.4455 259.5129 267.0485 287.1056 321.4982 367.8149 386.9136 477.0612 502.4554 550.2517 628.0971 702.1329 761.9265 833.6703 877.6756 901.6984 901.9080 919.4256 928.1992 965.5747 1025.9960 1041.9216 1067.0490 1113.5144 1117.0208 1128.3339 1153.7583 1163.0586 1211.9417 1226.5858 1242.3738 1291.3650 1297.2046 1305.9155 1347.8398 1366.1484 1366.8517 1371.9205 1379.4426 1389.3646 1392.6069 1444.6552 1457.0001 1461.2143 1463.7854 1468.1258 1472.5872 1476.6586 1479.6555 1484.9121 1488.1697 2953.7846 2971.4302 2972.9000 2979.0995 2980.1150 2980.7428 3002.4240 3052.1512 3060.1587 3061.8891 3065.8401 3072.2644 3073.2761 3076.1946 3086.7537 3090.1056 3094.2054 3150.0596
redmass: 2.9936 3.4007 2.7107 2.4716 2.6411 2.1494 1.4059 1.1198 1.1218 2.5372 1.1573 2.8083 2.4359 2.5605 2.5837 2.1764 2.9557 2.9816 2.4880 4.9631 3.0242 1.1506 2.3745 2.4119 1.2640 1.3126 1.3427 1.3509 1.6858 1.4707 2.4015 2.6758 1.4839 2.2280 2.2024 2.0988 1.9810 2.6095 1.4603 1.4988 1.2009 1.3654 1.3461 1.2978 1.3558 1.2162 1.2101 1.2875 1.2196 1.2495 1.0901 1.0494 1.0483 1.0623 1.0595 1.0536 1.0478 1.0585 1.0518 1.0547 1.0676 1.0348 1.0359 1.0628 1.0381 1.0542 1.0839 1.0924 1.0609 1.0971 1.0997 1.0982 1.0998 1.0990 1.1000 1.1001 1.0988 1.1126
irintensity: 0.1548 0.3857 0.4167 1.5247 0.6747 2.7561 0.0707 1.2190 0.0402 9.6021 0.4762 0.1050 1.9506 0.1267 0.3545 0.7165 10.2177 8.1149 17.2972 108.4924 14.0395 7.1971 0.8329 3.8735 2.2768 0.6860 0.5421 0.1944 7.6932 5.3423 4.9525 23.7011 24.4851 4.6371 24.7370 57.8772 25.3678 60.4295 34.2586 26.1213 14.0833 6.0391 2.7202 1.6551 10.0174 1.3398 49.1765 9.3392 13.0211 36.5087 9.2599 0.4171 2.2245 0.6839 6.9224 4.1461 18.8677 12.3626 13.8152 7.1960 28.1428 26.2787 24.2678 31.7472 34.1281 2.1247 15.5100 14.2005 16.0941 1.5767 4.5624 56.3042 57.3911 115.9868 27.1834 46.2345 31.9885 18.6388
temp: 298.150 k
press: 1.00000 atm
elementType: 17 7 6 6 6 6 6 6 6 6 1 1 1 1 1 1 1 1 1 1 1 1 1 1 1 1 1 1
symmnumber: 1
zpe: 649905.8 jmol-1
zpe.correction: 0.247536 hartree
zpe.thermalcorrener: 0.261281 hartree
zpe.thermalcorrenthalpy: 0.262225 hartree
zpe.thermalcorrgfe: 0.206581 hartree
zpe.sumelectzpe: -829.594020 hartree
zpe.sumelectthermal: -829.580275 hartree
zpe.sumelectthermalent: -829.579331 hartree
zpe.sumelectthermalfe: -829.634974 hartree
dipole: -3.3452 -0.0348 0.2612
dipole: 3.3556
quadrupole: -82.4544 -68.8815 -72.0125
quadrupole: 0.5202 1.1073 -0.0944
quadrupole: -8.0050 5.5680 2.4370 0.5202 1.1073 -0.0944
hfenergy: -829.8415559 hartree
pointgroup: C01 [X(C8H18Cl1N1)]
dipole: 1.2895397 -0.2689733 0.0873007 debye
polarizability: 126.4641991|-5.587092|101.8513191|2.2926197|0.2449365|91.8348128 unknown
InChI: InChI=1S/C8H18ClN/c1-7(2)10(6-5-9)8(3)4/h7-8H,5-6H2,1-4H3
charge 0 multiplicity 1
28 atoms
Cl -3.91292 0.543205 -0.328196
N  0.186489 -0.074288 -0.02993
C  0.566732 -1.513152 0.01088
C  1.235317 0.963287 0.154784
C  -1.186671 0.240724 0.392136
C  1.171944 -1.97642 1.367193
C  1.490535 -1.901075 -1.167989
C  1.389496 1.481138 1.615801
C  1.016676 2.150055 -0.815978
C  -2.103982 0.209662 -0.842021
H  -0.383874 -2.067282 -0.12902
H  2.191097 0.480202 -0.12657
H  -1.56897 -0.472577 1.152766
H  -1.239342 1.244473 0.849616
H  1.300732 -3.075003 1.379091
H  2.165056 -1.520587 1.535483
H  0.514029 -1.698582 2.211131
H  1.033508 -1.603344 -2.127713
H  1.663604 -2.9931 -1.178887
H  2.479506 -1.411984 -1.091173
H  2.251395 2.170823 1.68653
H  0.493445 2.041012 1.943425
H  1.55263 0.650349 2.323075
H  0.982841 1.792771 -1.859911
H  1.831263 2.892339 -0.720718
H  0.065037 2.671694 -0.598321
H  -1.848378 0.997542 -1.564725
H  -2.120495 -0.77668 -1.329559
