program: Gaussian 09
title: 000073012
version: EM64L-G09RevD.01
frameworkgroup: C1[X(C24H20F6N6O2)]
method: RPBEPBE
basis: SDD
operation: Freq
keyword: #p
keyword: freq=noraman
keyword: PBEPBE/SDD
title: #p freq=noraman PBEPBE/SDD
converged: NO YES NO NO
title: Mulliken charges:
elementType: F F F F F F O O N N N N N N C C C C C C C C C C C C C C C C C C C C C C C C H H H H H H H H H H H H H H H H H H H H
charge: -0.217621 -0.194750 -0.171695 -0.152296 -0.155129 -0.185733 -0.477085 -0.244279 -0.067931 -0.110846 -0.177571 -0.050259 -0.128506 -0.119143 0.181024 -0.472167 -0.425222 0.222909 0.257033 -0.290792 -0.202154 -0.521515 -0.389948 -0.144943 0.371966 0.111305 -0.289813 -0.292327 -0.299100 0.512967 -0.384973 -0.381174 0.346236 -0.315301 0.277182 -0.347091 -0.384006 0.077306 0.248248 0.263694 0.259146 0.243771 0.370342 0.282193 0.281654 0.284157 0.264388 0.296921 0.261783 0.244093 0.242105 0.232456 0.238597 0.225757 0.260031 0.244620 0.262916 0.228571
chargesum: 0.00000
title: Mulliken charges with hydrogens summed into heavy atoms:
elementType: F F F F F F O O N N N N N N C C C C C C C C C C C C C C C C C C C C C C C C
charge: -0.217621 -0.194750 -0.171695 -0.152296 -0.155129 -0.185733 -0.106742 -0.244279 -0.067931 -0.110846 -0.177571 -0.050259 -0.128506 -0.119143 0.181024 0.039775 0.077695 0.222909 0.257033 -0.008599 0.079500 -0.237358 -0.125560 0.151978 0.371966 0.111305 -0.028030 -0.048234 -0.056995 0.512967 -0.152516 -0.142577 0.346236 0.170487 0.277182 -0.102472 -0.121090 0.305877
polarizability: 5.07397434e+02 -4.97638253e+01 2.87843048e+02 -2.12263454e+01 9.57599090e-01 2.29930217e+02
1716.lowfreq: -9.0636 -2.6507 -1.6351 -0.0016 -0.0004 0.0010 7.0540 8.5942 15.4983
frequency: 6.3414 8.0951 15.4445 19.4043 28.5658 30.1137 35.3514 38.2361 42.0465 43.4646 52.4977 65.2981 67.0303 92.4127 100.3608 115.2875 131.3277 150.4900 155.0327 171.3815 174.4190 181.5995 200.3446 222.0630 224.5978 240.2151 258.4021 265.8952 276.7328 302.7332 309.3130 314.4883 331.0432 343.3556 346.9202 357.7581 378.8639 388.7096 392.0468 399.5585 415.7380 432.5586 459.4437 481.1729 491.1181 494.3277 502.8045 519.5486 520.2891 549.4131 560.2344 579.2451 611.4214 618.2219 633.1234 634.0981 655.8922 667.2437 685.9452 699.1678 710.1481 713.7743 740.2420 743.4670 754.1082 774.3577 777.0918 797.9505 810.6155 817.1573 821.4528 826.2847 831.9633 835.5809 844.7091 854.9414 855.9375 859.5565 886.2962 898.6097 914.6719 925.9801 933.2820 945.3777 966.4490 967.5409 976.4441 976.8245 982.4790 989.9347 992.8366 997.7211 1002.4573 1028.9624 1036.3240 1039.0772 1063.6856 1065.9008 1082.2125 1109.5435 1119.4948 1123.6679 1139.8609 1146.0988 1163.3679 1165.3004 1167.8118 1181.6359 1186.1520 1203.4395 1211.7383 1223.4551 1234.6670 1237.5798 1241.5306 1245.7764 1249.1521 1284.5173 1296.6086 1297.8889 1306.3307 1322.7419 1323.4530 1331.7187 1334.5221 1337.6691 1365.9758 1370.3953 1375.5195 1383.9187 1389.6032 1390.9689 1407.4094 1413.1022 1428.0901 1429.6988 1451.1988 1456.9247 1460.0757 1465.8606 1474.0448 1481.3564 1508.0803 1576.4371 1593.8509 1617.1685 1624.6798 1654.7537 2971.4490 3018.1353 3026.9814 3040.6123 3053.2660 3080.1213 3103.0966 3106.8533 3112.1080 3133.2041 3139.2862 3150.5976 3161.7225 3169.5996 3174.5646 3188.5275 3195.0206 3247.4602 3253.1208 3268.3661
redmass: 9.6532 8.7394 8.8283 8.8193 8.8978 6.3723 5.5399 6.8838 6.2562 9.0301 7.3224 6.8720 7.2898 7.9588 7.1459 5.9255 4.2701 5.4445 8.1263 6.5633 6.5636 7.8940 3.6941 6.1623 7.2922 13.2650 8.1217 10.0266 10.3304 5.5601 7.7861 5.0197 4.9089 5.1952 5.1169 4.1681 5.0055 4.1323 2.7838 4.6466 3.0266 6.1936 3.1346 6.1959 6.7174 4.7025 4.7683 2.9316 5.3442 8.9040 6.1673 5.5252 3.7749 4.0723 6.9226 4.4801 4.5054 3.3139 5.9518 4.3797 4.1697 7.0911 3.6349 4.3290 4.0904 1.3012 4.6867 5.0536 1.3516 4.6479 1.5512 1.4078 1.4316 1.5527 1.3972 3.3602 1.7586 3.9835 1.9952 2.7644 5.4385 4.4950 2.8084 1.3890 3.3220 1.3442 2.5869 2.4944 8.3004 4.1030 1.2081 4.6294 2.7364 3.9219 6.2870 3.3382 4.0477 2.3984 2.1353 2.3769 1.4025 1.6387 1.9989 2.5619 3.4441 1.9254 1.8429 1.5498 1.4000 3.7074 2.3474 2.2732 3.5712 2.6610 3.6837 1.4546 1.4851 2.0191 1.3767 1.2565 3.1471 1.4331 2.2478 2.0686 1.3838 1.4418 1.6486 3.0869 3.9127 2.1657 2.4066 2.3605 3.0871 4.1682 3.4405 2.7756 1.8668 1.1194 1.4564 1.4425 1.4356 3.0833 2.8017 6.8589 8.6977 6.0594 7.9154 5.9245 1.0580 1.0638 1.0626 1.1030 1.0696 1.0881 1.0905 1.1002 1.1000 1.0900 1.0874 1.0892 1.0957 1.0886 1.0956 1.0967 1.0942 1.1003 1.0974 1.1019
irintensity: 0.0769 0.6194 0.2356 0.9169 0.4318 1.2446 1.1756 0.7081 0.5044 0.9021 1.8167 1.3129 1.7069 0.2720 0.3434 0.7397 6.6252 2.9124 2.8176 0.8053 5.2528 1.9946 1.8908 2.7384 0.5211 4.8051 1.3430 3.1514 3.0451 1.1415 5.5770 3.3663 1.1413 1.1604 3.3614 2.9626 4.2255 3.1330 1.8033 0.7581 0.1105 11.8616 7.7703 6.1277 3.0180 7.9429 23.1138 13.7962 5.6946 23.1952 2.4396 2.5747 10.4802 24.3318 1.1020 19.2462 5.2648 30.6121 96.8216 22.6700 0.6657 3.2971 6.7702 4.6550 9.1001 84.4592 54.8757 13.0882 12.2695 40.0373 33.0104 17.3885 6.5718 77.9729 15.2099 20.6608 58.1998 7.0154 0.3410 68.2744 14.3896 59.7298 13.6136 7.7083 35.7571 4.4041 122.5304 63.7426 171.1523 24.1634 43.6914 11.9572 26.0752 15.3150 26.1488 3.2173 29.1169 34.8537 24.5595 25.1730 17.9758 11.8032 4.6815 23.3948 219.4177 38.1153 2.5667 28.1761 72.2215 81.2681 41.6643 9.9437 23.1925 298.1283 67.7065 37.8045 5.5493 7.8693 5.0100 1.2804 9.5698 1.8383 7.1187 24.1658 8.9958 24.3368 39.4281 19.8143 5.9238 28.2125 5.5791 5.5753 13.3990 9.5399 22.6668 39.0573 97.3027 45.6997 83.0120 19.6791 61.4642 87.8434 249.4342 1.9933 38.6587 218.1789 85.3015 65.1503 63.9275 10.6195 39.1370 9.9040 1008.6197 18.3437 8.3091 1.0331 6.2921 9.8302 19.7048 7.7796 18.1504 0.0365 4.4680 2.3296 1.6015 1.3835 1.3140 2.8854
temp: 298.150 k
press: 1.00000 atm
elementType: 9 9 9 9 9 9 8 8 7 7 7 7 7 7 6 6 6 6 6 6 6 6 6 6 6 6 6 6 6 6 6 6 6 6 6 6 6 6 1 1 1 1 1 1 1 1 1 1 1 1 1 1 1 1 1 1 1 1
symmnumber: 1
zpe: 1086386.2 jmol-1
zpe.correction: 0.413783 hartree
zpe.thermalcorrener: 0.447934 hartree
zpe.thermalcorrenthalpy: 0.448878 hartree
zpe.thermalcorrgfe: 0.339294 hartree
zpe.sumelectzpe: -2001.760218 hartree
zpe.sumelectthermal: -2001.726067 hartree
zpe.sumelectthermalent: -2001.725123 hartree
zpe.sumelectthermalfe: -2001.834707 hartree
dipole: -1.2835 -5.0432 -4.7105
dipole: 7.0192
quadrupole: -243.5436 -234.3941 -219.1905
quadrupole: 4.8527 -3.6645 -0.1463
quadrupole: -11.1675 -2.0181 13.1856 4.8527 -3.6645 -0.1463
hfenergy: -2002.1740008 hartree
pointgroup: C01 [X(C24H20F6N6O2)]
dipole: -0.5939925 -0.491356 -2.6517989 debye
polarizability: 504.0907611|-25.5980939|266.2056664|-55.3838283|28.7262845|254.8742713 unknown
InChI: InChI=1S/C24H20F6N6O2/c25-17-4-7-19(20(26)9-17)23(37,10-35-14-31-13-33-35)11-36-15-32-21(34-36)8-3-16-1-5-18(6-2-16)38-12-24(29,30)22(27)28/h1-9,13-15,22,37H,10-12H2
charge 0 multiplicity 1
58 atoms
F  6.277265 -1.221993 -1.594181
F  5.247855 -3.966025 2.224077
F  -9.35557 1.59142 0.474418
F  -8.928236 0.399094 2.383387
F  -11.299844 -0.415469 1.47732
F  -9.816726 -1.994941 0.706833
O  3.282081 1.653747 -0.231783
O  -6.706927 0.83654 0.664267
N  2.80878 -0.184265 -2.466991
N  6.023362 2.086837 0.622521
N  1.638863 0.260896 -1.83664
N  7.228804 1.584619 1.141674
N  1.251849 -1.704435 -2.997102
N  6.10497 2.865239 2.722704
C  4.368304 0.861085 -0.808565
C  4.044102 0.593875 -2.315671
C  5.633139 1.765667 -0.748351
C  4.581188 -0.445099 -0.021334
C  5.520835 -1.425192 -0.406653
C  3.874547 -0.691594 1.180258
C  2.548186 -1.354473 -3.143883
C  5.76984 -2.605712 0.303754
C  4.081688 -1.862006 1.941323
C  5.376489 2.84112 1.579936
C  5.026119 -2.794623 1.481606
C  0.71341 -0.693587 -2.187057
C  7.217548 2.088522 2.407009
C  -0.684455 -0.689961 -1.792391
C  -1.28388 0.303049 -1.061468
C  -2.687983 0.365393 -0.641675
C  -3.637388 -0.660394 -0.911147
C  -3.140983 1.51446 0.074915
C  -5.395558 0.609223 0.206939
C  -7.693383 -0.192405 0.385125
C  -9.021261 0.289026 0.971192
C  -4.978065 -0.550028 -0.496114
C  -4.473273 1.642685 0.49529
C  -10.221494 -0.622984 0.591799
H  4.858666 0.038537 -2.805281
H  3.910948 1.572266 -2.812994
H  6.493913 1.261046 -1.214284
H  5.407421 2.697773 -1.296532
H  2.4120 1.305753 -0.630377
H  3.162482 0.068132 1.513523
H  3.298375 -1.901448 -3.708461
H  6.510549 -3.333713 -0.034552
H  3.534448 -2.045568 2.869291
H  4.411072 3.307868 1.413728
H  8.027482 1.891981 3.10417
H  -1.240922 -1.564179 -2.146885
H  -0.661716 1.157223 -0.758147
H  -3.329964 -1.56255 -1.450459
H  -2.429995 2.318269 0.299737
H  -7.809517 -0.350236 -0.707198
H  -7.428141 -1.154705 0.863283
H  -5.674074 -1.364487 -0.720185
H  -4.821556 2.52335 1.042187
H  -10.568773 -0.448024 -0.441405
