program: Gaussian 09
title: 000060802
version: EM64L-G09RevD.01
frameworkgroup: C1[X(C10H16N2O4S3)]
method: RPBEPBE
basis: SDD
operation: Freq
keyword: #p
keyword: freq=noraman
keyword: PBEPBE/SDD
title: #p freq=noraman PBEPBE/SDD
converged: YES YES NO NO
title: Mulliken charges:
elementType: S S S O O O O N N C C C C C C C C C C H H H H H H H H H H H H H H H H
charge: 0.865267 0.498768 0.970471 -0.539906 -0.533526 -0.512191 -0.529128 -0.373231 -0.705337 -0.254072 -0.127664 -0.470828 0.812076 -0.839512 -0.689724 -0.234380 -0.460822 -0.327024 -0.689353 0.318480 0.232179 0.225851 0.271225 0.255323 0.223934 0.258207 0.286874 0.313017 0.195281 0.211712 0.233955 0.209092 0.222195 0.335612 0.347182
chargesum: 0.00000
title: Mulliken charges with hydrogens summed into heavy atoms:
elementType: S S S O O O O N N C C C C C C C C C C
charge: 0.865267 0.498768 0.970471 -0.539906 -0.533526 -0.512191 -0.529128 -0.086358 -0.022543 0.064407 0.104515 0.026248 0.812076 -0.839512 0.047740 0.078637 -0.460822 0.079968 -0.024112
polarizability: 2.68491798e+02 6.30702240e-01 2.13872393e+02 7.84709698e+00 -9.31742875e+00 1.51278168e+02
1716.lowfreq: -3.8182 -0.0021 -0.0019 -0.0010 1.2607 5.5860 11.8209 19.0403 48.2990
frequency: 11.4408 18.6144 48.2436 54.9418 56.9425 70.6088 85.4149 106.1195 131.3176 139.4214 154.9515 168.9633 178.6747 184.8848 200.5772 205.4469 220.9449 239.0229 244.5972 265.6487 294.8728 305.5916 317.7491 320.6361 330.6751 367.8443 381.6258 417.1565 434.8413 445.1544 464.6489 480.6716 508.4625 522.2873 547.4285 597.6838 653.6994 661.4115 706.9946 785.0049 798.7788 800.7781 808.9955 828.4614 858.9814 893.2142 905.4585 912.9162 920.4308 925.2347 942.8256 960.0625 995.5805 1037.2767 1048.3264 1075.6023 1092.8403 1112.2708 1121.5263 1135.1643 1154.1667 1167.8291 1175.4728 1239.0652 1258.2786 1272.8520 1286.8481 1303.3370 1340.6341 1370.6558 1382.3699 1393.7596 1394.1975 1443.8494 1450.3251 1451.0968 1460.7560 1472.5162 1478.0038 1480.2156 1498.2779 1532.3361 1544.3481 2878.5313 2881.6616 2983.2321 2985.7335 2988.5058 3003.7359 3040.1156 3067.0915 3076.8874 3082.0160 3097.5911 3101.7033 3177.5261 3372.4918 3456.5216 3541.3953
redmass: 6.9483 4.8364 4.0828 5.6224 1.8319 5.3163 6.2998 3.0576 4.5596 2.4590 5.1433 2.7594 2.6891 4.2628 2.0319 3.7270 4.3849 1.5783 2.9149 2.4867 7.0044 5.7586 5.9271 5.4377 2.8054 6.4055 6.1754 7.5212 4.1095 4.4426 3.4312 4.2526 6.6731 5.6363 2.2574 2.4034 5.4958 4.8124 4.5717 1.7201 13.1975 9.7673 1.1336 3.3902 2.3028 1.3726 3.1598 4.0308 2.0430 3.4532 5.9652 2.7151 1.9936 1.8263 2.6542 1.5287 2.4934 2.0039 1.9538 1.9633 1.6175 1.6887 1.5672 1.3204 1.1551 1.3484 1.4910 1.3821 1.7721 1.4690 2.0728 1.2361 1.2010 1.1027 1.5591 3.3129 1.0619 1.0670 1.0517 1.0458 1.0851 1.1035 6.5919 1.0724 1.0809 1.0380 1.0464 1.0508 1.0868 1.1004 1.0889 1.0982 1.0969 1.1004 1.1002 1.0953 1.0413 1.0755 1.1010
irintensity: 0.7354 1.6623 0.9240 0.9713 0.9483 1.0272 6.3327 11.0581 3.3728 17.3107 0.9444 0.6055 2.0611 1.0294 2.5220 8.2143 16.6686 4.1156 7.1572 7.5643 0.2657 2.5199 12.7694 8.3388 8.9372 5.1467 16.6793 31.4282 44.8434 49.6612 97.0496 87.1659 20.7607 89.9253 16.0315 40.4637 7.3514 5.3263 9.7189 157.8398 134.7450 44.5522 1.1121 21.1777 22.6800 15.4410 52.9444 43.6116 16.3646 59.7069 17.7685 5.5551 29.0069 6.6325 5.4729 27.9527 6.0441 9.1134 8.7296 24.7351 14.9995 31.7675 18.4498 35.2047 27.7627 2.5554 21.0740 2.8213 0.2167 2.2695 6.0366 26.5616 18.1113 15.8662 13.6016 19.0363 22.8717 21.4237 16.8643 3.1600 8.1962 23.1050 13.8501 72.4760 79.2650 24.7450 4.6915 27.4664 31.7711 11.1277 3.9580 43.1912 5.1513 31.3110 7.7793 4.3969 40.7942 2.3020 30.9145
temp: 298.150 k
press: 1.00000 atm
elementType: 16 16 16 8 8 8 8 7 7 6 6 6 6 6 6 6 6 6 6 1 1 1 1 1 1 1 1 1 1 1 1 1 1 1 1
symmnumber: 1
zpe: 674645.2 jmol-1
zpe.correction: 0.256959 hartree
zpe.thermalcorrener: 0.279638 hartree
zpe.thermalcorrenthalpy: 0.280582 hartree
zpe.thermalcorrgfe: 0.202714 hartree
zpe.sumelectzpe: -1993.385858 hartree
zpe.sumelectthermal: -1993.363179 hartree
zpe.sumelectthermalent: -1993.362235 hartree
zpe.sumelectthermalfe: -1993.440103 hartree
dipole: -2.8247 7.9040 1.2803
dipole: 8.4907
quadrupole: -128.0332 -149.1306 -142.7907
quadrupole: -10.8735 22.5254 2.7270
quadrupole: 11.9516 -9.1458 -2.8059 -10.8735 22.5254 2.7270
hfenergy: -1993.642817 hartree
pointgroup: C01 [X(C10H16N2O4S3)]
dipole: -1.6158157 2.8952319 0.4070069 debye
polarizability: 266.190229|9.7918714|215.240848|12.5464063|-8.6944673|152.2112827 unknown
InChI: InChI=1S/C10H16N2O4S3/c1-3-12-8-4-6(2)18(13,14)10-7(8)5-9(17-10)19(11,15)16/h5-6,8,12H,3-4,11H2,1-2H3
charge 0 multiplicity 1
35 atoms
S  -1.366686 -2.296021 0.296378
S  1.705631 -1.450402 0.523959
S  3.904881 0.793114 -0.019035
O  -1.28772 -3.344842 -0.956828
O  -1.332226 -2.864403 1.826889
O  4.881405 -0.402878 -0.519154
O  3.856613 2.265999 -0.714926
N  -1.966221 1.759729 0.23504
N  4.242596 0.986281 1.771716
C  -2.926269 -1.097773 0.000838
C  -1.483044 0.860386 -0.847007
C  -2.563141 -0.204374 -1.186879
C  -0.15851 0.240687 -0.427996
C  0.012259 -1.034151 0.095611
C  -4.12131 -2.024331 -0.194981
C  1.097313 0.952123 -0.489842
C  2.153703 0.194136 -0.027196
C  -2.838747 2.877659 -0.193282
C  -3.225201 3.753401 1.010127
H  -2.937731 -0.532008 0.948129
H  -1.289332 1.439278 -1.783064
H  -3.488718 0.316725 -1.500636
H  -2.240817 -0.823554 -2.047654
H  -4.287074 -2.667502 0.686322
H  -5.029168 -1.410348 -0.345642
H  -3.985358 -2.669374 -1.080995
H  -1.209289 2.073229 0.856381
H  1.22131 1.965773 -0.880629
H  -2.354674 3.507759 -0.979789
H  -3.755439 2.454791 -0.648177
H  -3.742514 3.151647 1.777414
H  -2.330743 4.209361 1.476005
H  -3.894097 4.573722 0.695818
H  4.241009 1.990369 2.014081
H  5.133008 0.506192 1.982905
