program: Orca
programVersion: 5.0.2
elementType: F F F F F F O O O O O N C C C C C C C C C C C C C C C C C C C C C C C C C C H H H H H H H H H H H H H H H H H H H H H
charge: 0
multiplicity: 1
keywords: wb97x-d3
keywords: def2-TZVPP
keywords: def2/J RIJCOSX
keywords: DEFGRID2
keywords: scfconv7
keywords: smallprint printgap noloewdin
keywords: NOSOSCF
formula: C26H21F6NO5
InChI: InChI=1/C26H21F6NO5/c1-24(2)18(11-12-20(34)38-23(25(27,28)29)26(30,31)32)21(24)22(35)37-19(14-33)15-7-6-10-17(13-15)36-16-8-4-3-5-9-16/h3-13,18-19,21,23H,1-2H3
59 atoms
F  3.876756 0.37157 -0.788816
F  4.718817 0.902967 -2.70193
F  5.316955 1.954691 -0.918171
F  3.600475 3.187335 -3.916805
F  2.50351 4.472984 -2.577345
F  4.608167 4.165538 -2.28595
O  -1.468149 -0.025696 -0.030545
O  -0.194999 0.521018 1.731881
O  2.789482 2.839597 -0.476382
O  0.585963 2.65529 -0.88898
O  -3.300297 -5.304657 0.495527
N  1.1506 -0.600987 -1.989349
C  -2.31811 2.812006 2.108932
C  -1.166737 3.356986 1.333777
C  -1.819509 2.066392 0.884407
C  -3.6570 3.491352 1.943081
C  -2.098005 2.251875 3.492447
C  0.195075 3.428469 1.910457
C  -1.058859 0.806346 0.949649
C  1.360411 3.296553 1.276535
C  -0.711918 -1.20704 -0.252111
C  1.481041 2.903386 -0.131424
C  -1.648034 -2.278132 -0.746304
C  0.337421 -0.884075 -1.228882
C  -2.014542 -3.293106 0.126973
C  3.12688 2.36637 -1.754579
C  -2.176962 -2.225747 -2.028484
C  -2.924379 -4.259427 -0.285573
C  -3.076307 -3.199546 -2.431051
C  4.285414 1.388333 -1.540408
C  3.476453 3.564666 -2.645402
C  -3.457613 -4.211887 -1.566736
C  -3.273145 -5.192359 1.858708
C  -2.605539 -6.173034 2.574898
C  -3.940855 -4.165406 2.514072
C  -2.61136 -6.127808 3.961362
C  -3.930201 -4.126327 3.899289
C  -3.267139 -5.104047 4.627697
H  -1.381553 4.182956 0.660801
H  -2.439082 2.150888 0.000496
H  -3.787533 3.898669 0.939859
H  -3.758852 4.316847 2.649658
H  -4.474717 2.792792 2.126699
H  -2.158371 3.054597 4.230077
H  -1.139411 1.753957 3.614174
H  -2.877208 1.528103 3.735829
H  0.248009 3.67054 2.966749
H  2.281914 3.433711 1.826041
H  -0.219413 -1.532212 0.668612
H  -1.589813 -3.330013 1.122797
H  2.298095 1.819711 -2.220882
H  -1.887424 -1.437198 -2.710831
H  -3.493122 -3.168294 -3.428616
H  -4.161203 -4.972438 -1.878213
H  -2.094827 -6.966871 2.046002
H  -4.469149 -3.408625 1.948152
H  -2.094098 -6.895798 4.520867
H  -4.451612 -3.328943 4.4120
H  -3.266426 -5.069896 5.708604
totalener: -2033.56198624 hartree
nucrepener: 4315.95749986 hartree
electener: -6349.51948610 hartree
twoeener: 5030.23475184 hartree
kineticenergy: 2025.83454092 hartree
xcener: -182.495293617253 hartree
chargesum: -0.0000000
charge: -0.152871 -0.158904 -0.157233 -0.157270 -0.159743 -0.155930 -0.255413 -0.374583 -0.268402 -0.369461 -0.294740 -0.065218 0.098291 -0.015903 -0.053517 -0.235423 -0.284961 -0.117856 0.319498 -0.186716 0.331660 0.431000 0.031785 -0.214861 -0.147643 0.011139 -0.186306 0.219357 -0.089658 0.487141 0.467159 -0.194527 0.227543 -0.195149 -0.165361 -0.096224 -0.109973 -0.136854 0.101539 0.083321 0.077313 0.089370 0.092333 0.092159 0.108579 0.088860 0.121861 0.122848 0.115018 0.121804 0.134044 0.122718 0.129602 0.128964 0.128350 0.133455 0.128517 0.127366 0.128108
qa: -0.1529 -0.1589 -0.1572 -0.1573 -0.1597 -0.1559 -0.2554 -0.3746 -0.2684 -0.3695 -0.2947 -0.0652 0.0983 -0.0159 -0.0535 -0.2354 -0.2850 -0.1179 0.3195 -0.1867 0.3317 0.4310 0.0318 -0.2149 -0.1476 0.0111 -0.1863 0.2194 -0.0897 0.4871 0.4672 -0.1945 0.2275 -0.1951 -0.1654 -0.0962 -0.1100 -0.1369 0.1015 0.0833 0.0773 0.0894 0.0923 0.0922 0.1086 0.0889 0.1219 0.1228 0.1150 0.1218 0.1340 0.1227 0.1296 0.1290 0.1284 0.1335 0.1285 0.1274 0.1281
va: 1.1588 1.1594 1.1593 1.1575 1.1521 1.1621 2.1451 2.1066 2.1210 2.1198 2.1138 3.0554 3.7389 3.8686 3.8455 3.9016 3.9097 3.9406 4.1854 3.9202 3.8251 4.1551 3.7506 3.9400 3.9064 3.9149 4.0565 3.8839 3.9467 4.5014 4.5330 4.0335 3.8192 4.0403 3.9650 3.9346 3.9416 3.9606 1.0167 1.0351 1.0077 1.0044 1.0043 0.9986 1.0152 1.0051 0.9926 1.0156 1.0338 1.0128 1.0487 1.0166 0.9994 1.0121 1.0125 1.0033 0.9988 0.9999 1.0000
dispcorr: -0.032058360 hartree
energy: -2033.594044601369
dipole: -65.25968 62.95315 -2.30653 -21.83108 21.69650 -0.13458 43.26838 -41.52451 1.74387
magnitude: 2.89470 au
magnitude: 7.35774 debye
