program: Orca
programVersion: 5.0.2
elementType: F F F F F F O O O O O N C C C C C C C C C C C C C C C C C C C C C C C C C C H H H H H H H H H H H H H H H H H H H H H
charge: 0
multiplicity: 1
keywords: wb97x-d3
keywords: def2-TZVPP
keywords: def2/J RIJCOSX
keywords: DEFGRID2
keywords: scfconv7
keywords: smallprint printgap noloewdin
keywords: NOSOSCF
formula: C26H21F6NO5
InChI: InChI=1/C26H21F6NO5/c1-24(2)18(11-12-20(34)38-23(25(27,28)29)26(30,31)32)21(24)22(35)37-19(14-33)15-7-6-10-17(13-15)36-16-8-4-3-5-9-16/h3-13,18-19,21,23H,1-2H3
59 atoms
F  3.52299 5.180033 -1.196357
F  5.644145 5.545815 -1.102924
F  4.751108 4.814033 -2.923623
F  6.512033 2.658532 -2.739109
F  7.246694 3.333498 -0.82843
F  6.28055 1.417556 -0.999219
O  -3.122458 -0.016634 0.258826
O  -1.947259 -0.427942 -1.597381
O  3.908341 2.524437 -1.71105
O  3.029136 1.969745 0.278043
O  -4.787178 -4.714387 1.686223
N  -6.258891 0.890111 0.837001
C  0.24104 -1.148123 0.549417
C  0.59393 0.23968 0.078021
C  -0.831227 -0.083075 0.50827
C  0.732423 -1.532291 1.924028
C  0.219816 -2.312739 -0.41043
C  0.9637 0.50329 -1.314733
C  -1.974465 -0.192108 -0.419976
C  2.006574 1.218396 -1.758436
C  -4.323782 -0.306947 -0.446031
C  2.987655 1.910994 -0.919331
C  -4.566867 -1.795694 -0.519178
C  -5.393309 0.371105 0.289163
C  -4.563715 -2.53989 0.655847
C  4.902581 3.29989 -1.098229
C  -4.770906 -2.407524 -1.743932
C  -4.752655 -3.912441 0.591483
C  -4.985842 -3.778128 -1.791853
C  4.713135 4.732771 -1.598734
C  6.258928 2.67585 -1.435065
C  -4.968205 -4.533729 -0.634895
C  -4.147717 -4.354722 2.84001
C  -2.812987 -3.968529 2.847906
C  -4.861667 -4.449831 4.024309
C  -2.20254 -3.666097 4.054742
C  -4.234175 -4.157236 5.225924
C  -2.907047 -3.757247 5.246508
H  1.120352 0.837613 0.808094
H  -1.104778 0.330844 1.471627
H  0.739585 -0.685847 2.610639
H  1.748632 -1.925149 1.870303
H  0.096104 -2.307251 2.355403
H  -0.435273 -3.098944 -0.029869
H  1.222715 -2.732748 -0.49542
H  -0.122641 -2.064887 -1.410372
H  0.335569 0.066003 -2.079401
H  2.151233 1.307572 -2.826764
H  -4.292591 0.113354 -1.456196
H  -4.420424 -2.049308 1.610974
H  4.798278 3.302091 -0.006884
H  -4.754248 -1.824744 -2.655269
H  -5.151491 -4.265116 -2.743221
H  -5.123873 -5.60396 -0.667175
H  -2.254285 -3.909928 1.92187
H  -5.898807 -4.756897 3.999439
H  -1.163033 -3.365379 4.064149
H  -4.791811 -4.236117 6.149606
H  -2.422271 -3.52308 6.184401
totalener: -2033.56550126 hartree
nucrepener: 4124.52936872 hartree
electener: -6158.09486998 hartree
twoeener: 4836.73272084 hartree
kineticenergy: 2025.82143478 hartree
xcener: -182.495403562280 hartree
chargesum: 0.0000000
charge: -0.159289 -0.155737 -0.150979 -0.151308 -0.156357 -0.158765 -0.263300 -0.383898 -0.271060 -0.374693 -0.293547 0.003636 0.057490 -0.005115 -0.045796 -0.217414 -0.250068 -0.125055 0.330653 -0.272719 0.323588 0.445391 0.032811 -0.259987 -0.207166 0.018672 -0.150222 0.242940 -0.079721 0.469879 0.468559 -0.214482 0.226275 -0.158975 -0.189094 -0.112888 -0.094743 -0.141040 0.123295 0.096077 0.083157 0.099609 0.062788 0.089258 0.100247 0.101327 0.146044 0.125087 0.121339 0.136332 0.128364 0.109968 0.129210 0.130126 0.125452 0.127631 0.131556 0.128381 0.128273
qa: -0.1593 -0.1557 -0.1510 -0.1513 -0.1564 -0.1588 -0.2633 -0.3839 -0.2711 -0.3747 -0.2935 0.0036 0.0575 -0.0051 -0.0458 -0.2174 -0.2501 -0.1251 0.3307 -0.2727 0.3236 0.4454 0.0328 -0.2600 -0.2072 0.0187 -0.1502 0.2429 -0.0797 0.4699 0.4686 -0.2145 0.2263 -0.1590 -0.1891 -0.1129 -0.0947 -0.1410 0.1233 0.0961 0.0832 0.0996 0.0628 0.0893 0.1002 0.1013 0.1460 0.1251 0.1213 0.1363 0.1284 0.1100 0.1292 0.1301 0.1255 0.1276 0.1316 0.1284 0.1283
va: 1.1545 1.1612 1.1682 1.1683 1.1592 1.1550 2.1349 2.1019 2.1156 2.1231 2.1237 3.1189 3.8004 3.7681 3.8597 3.9135 3.9118 3.8821 4.1819 3.9753 3.8421 4.1480 3.6622 4.0255 3.9573 3.9124 4.0192 3.8394 3.9483 4.5171 4.5158 4.0412 3.8706 3.9665 4.0362 3.9321 3.9419 3.9917 1.0339 1.0296 1.0101 1.0064 1.0133 1.0064 1.0017 1.0177 1.0097 1.0171 1.0206 1.0183 1.0557 1.0149 0.9992 1.0120 0.9993 1.0129 0.9965 0.9985 1.0009
dispcorr: -0.031402906 hartree
energy: -2033.596904168304
dipole: -59.85233 60.04656 0.19423 -58.88480 57.21594 -1.66885 26.46736 -26.28015 0.18722
magnitude: 1.69052 au
magnitude: 4.29696 debye
