program: Orca
programVersion: 5.0.2
elementType: F F F F F F O O O O O N C C C C C C C C C C C C C C C C C C C C C C C C C C H H H H H H H H H H H H H H H H H H H H H
charge: 0
multiplicity: 1
keywords: wb97x-d3
keywords: def2-TZVPP
keywords: def2/J RIJCOSX
keywords: DEFGRID2
keywords: scfconv7
keywords: smallprint printgap noloewdin
keywords: NOSOSCF
formula: C26H21F6NO5
InChI: InChI=1/C26H21F6NO5/c1-24(2)18(11-12-20(34)38-23(25(27,28)29)26(30,31)32)21(24)22(35)37-19(14-33)15-7-6-10-17(13-15)36-16-8-4-3-5-9-16/h3-13,18-19,21,23H,1-2H3
59 atoms
F  5.92912 4.455299 -2.447932
F  5.62326 2.406355 -3.029759
F  3.987394 3.794917 -3.116352
F  5.291622 2.331663 1.117961
F  6.606201 1.843748 -0.509726
F  6.527435 3.860426 0.238426
O  -3.67251 0.04228 -0.990403
O  -1.859722 -1.16178 -0.493334
O  3.807905 2.000587 -1.039965
O  2.079623 3.154221 -0.183456
O  -4.118565 -4.72669 1.919074
N  -6.153119 -0.381981 -3.127761
C  -1.234638 1.321092 1.323633
C  -0.430233 1.525103 0.06689
C  -1.917429 1.194825 -0.019731
C  -1.576444 2.56172 2.113834
C  -0.989623 0.116091 2.19812
C  0.597829 0.563148 -0.344086
C  -2.426851 -0.1008 -0.512757
C  1.879363 0.810192 -0.640937
C  -4.332914 -1.150071 -1.420485
C  2.533233 2.1174 -0.579881
C  -4.925957 -1.890391 -0.24626
C  -5.350497 -0.706793 -2.373809
C  -4.254657 -2.996888 0.253328
C  4.644375 3.121885 -0.980839
C  -6.086841 -1.435086 0.367556
C  -4.732857 -3.634293 1.391424
C  -6.569176 -2.096466 1.484921
C  5.065748 3.442838 -2.416179
C  5.797118 2.780236 -0.030338
C  -5.89293 -3.187574 2.00868
C  -2.75145 -4.794278 1.937435
C  -2.172706 -6.027635 1.6758
C  -1.960787 -3.695439 2.255027
C  -0.793528 -6.161153 1.736006
C  -0.583017 -3.842419 2.302223
C  0.007504 -5.070928 2.043956
H  -0.210658 2.559084 -0.161688
H  -2.545948 2.033096 -0.295851
H  -1.747964 3.424731 1.470444
H  -0.764295 2.815309 2.796433
H  -2.478178 2.402225 2.707519
H  -0.162568 0.326397 2.877836
H  -0.746282 -0.788017 1.647374
H  -1.871638 -0.091517 2.806865
H  0.293028 -0.471256 -0.426746
H  2.50435 -0.017615 -0.947809
H  -3.634467 -1.799577 -1.956846
H  -3.351149 -3.347277 -0.228367
H  4.121015 3.996248 -0.575164
H  -6.61965 -0.579613 -0.027603
H  -7.47692 -1.753387 1.963248
H  -6.258774 -3.697772 2.890353
H  -2.803568 -6.872663 1.431347
H  -2.41122 -2.732983 2.463015
H  -0.344282 -7.124315 1.532119
H  0.032492 -2.986802 2.550945
H  1.083266 -5.177447 2.084777
totalener: -2033.56549247 hartree
nucrepener: 4166.18256276 hartree
electener: -6199.74805522 hartree
twoeener: 4878.45087407 hartree
kineticenergy: 2025.82612627 hartree
xcener: -182.496631020727 hartree
chargesum: -0.0000000
charge: -0.156327 -0.150649 -0.158544 -0.160326 -0.150918 -0.156095 -0.251713 -0.410242 -0.270064 -0.370986 -0.298340 0.001069 0.094161 0.019388 -0.101033 -0.229254 -0.263899 -0.139200 0.390342 -0.257015 0.320319 0.438716 -0.003850 -0.256658 -0.141792 0.014793 -0.172435 0.215523 -0.094939 0.470468 0.471876 -0.194890 0.238398 -0.209667 -0.151786 -0.090045 -0.096917 -0.152517 0.108838 0.096232 0.079109 0.096451 0.091686 0.107320 0.061473 0.098499 0.154392 0.124954 0.121887 0.131311 0.126882 0.123104 0.131408 0.130858 0.126522 0.126571 0.127190 0.123983 0.126375
qa: -0.1563 -0.1506 -0.1585 -0.1603 -0.1509 -0.1561 -0.2517 -0.4102 -0.2701 -0.3710 -0.2983 0.0011 0.0942 0.0194 -0.1010 -0.2293 -0.2639 -0.1392 0.3903 -0.2570 0.3203 0.4387 -0.0039 -0.2567 -0.1418 0.0148 -0.1724 0.2155 -0.0949 0.4705 0.4719 -0.1949 0.2384 -0.2097 -0.1518 -0.0900 -0.0969 -0.1525 0.1088 0.0962 0.0791 0.0965 0.0917 0.1073 0.0615 0.0985 0.1544 0.1250 0.1219 0.1313 0.1269 0.1231 0.1314 0.1309 0.1265 0.1266 0.1272 0.1240 0.1264
va: 1.1605 1.1684 1.1552 1.1524 1.1681 1.1585 2.1486 2.0590 2.1131 2.1270 2.1196 3.1156 3.7913 3.7470 3.9072 3.9158 3.9310 3.8769 4.1006 3.9589 3.8231 4.1536 3.6563 4.0145 3.9099 3.9135 4.0426 3.8811 3.9426 4.5173 4.5097 4.0476 3.8539 4.0352 3.9333 3.9390 3.9354 3.9944 1.0345 1.0293 1.0099 1.0044 1.0029 1.0045 1.0164 0.9993 1.0084 1.0174 1.0186 1.0222 1.0550 1.0160 0.9993 1.0109 1.0134 0.9995 0.9981 0.9993 1.0009
dispcorr: -0.031852662 hartree
energy: -2033.597345129585
dipole: -64.79829 64.63299 -0.16529 -35.76307 35.31801 -0.44506 30.63854 -29.10190 1.53664
magnitude: 1.60831 au
magnitude: 4.08800 debye
