program: Orca
programVersion: 5.0.2
elementType: F F F F F F O O O O O N C C C C C C C C C C C C C C C C C C C C C C C C C C H H H H H H H H H H H H H H H H H H H H H
charge: 0
multiplicity: 1
keywords: wb97x-d3
keywords: def2-TZVPP
keywords: def2/J RIJCOSX
keywords: DEFGRID2
keywords: scfconv7
keywords: smallprint printgap noloewdin
keywords: NOSOSCF
formula: C26H21F6NO5
InChI: InChI=1/C26H21F6NO5/c1-24(2)18(11-12-20(34)38-23(25(27,28)29)26(30,31)32)21(24)22(35)37-19(14-33)15-7-6-10-17(13-15)36-16-8-4-3-5-9-16/h3-13,18-19,21,23H,1-2H3
59 atoms
F  3.795392 3.214132 0.074224
F  4.587042 1.278831 -0.439635
F  3.031621 2.169406 -1.640303
F  2.89358 -0.85952 -0.073082
F  1.027422 -0.4542 0.933002
F  1.27895 0.093185 -1.130621
O  -2.220719 0.300536 -0.284221
O  -2.82111 2.17313 0.77251
O  1.33162 2.241344 0.576092
O  1.827175 2.843185 2.682077
O  -0.995987 -4.683613 -0.928285
N  -1.697044 -0.47881 2.981754
C  -1.809233 3.62983 -1.778331
C  -0.675224 3.568789 -0.811366
C  -1.426591 2.292826 -1.171234
C  -1.440534 3.784005 -3.236318
C  -3.106468 4.315761 -1.426668
C  -0.770011 4.136068 0.55076
C  -2.231228 1.636268 -0.12483
C  0.018935 3.904052 1.603245
C  -2.937983 -0.458674 0.677393
C  1.142284 2.970077 1.709815
C  -3.069423 -1.868555 0.16274
C  -2.232953 -0.445207 1.966537
C  -1.925734 -2.6005 -0.134923
C  2.427004 1.371651 0.524051
C  -4.327505 -2.423505 -0.001661
C  -2.052802 -3.904273 -0.590151
C  -4.442011 -3.726621 -0.46809
C  3.475346 2.008727 -0.393655
C  1.900039 0.01746 0.044805
C  -3.314422 -4.469537 -0.758199
C  0.245574 -4.434486 -0.40586
C  0.45277 -4.35593 0.964985
C  1.306217 -4.321473 -1.290464
C  1.737857 -4.158755 1.445012
C  2.588926 -4.13681 -0.795905
C  2.809005 -4.050851 0.569974
H  0.317618 3.603153 -1.245179
H  -0.902052 1.60737 -1.82443
H  -0.494661 3.295912 -3.474349
H  -1.342405 4.839378 -3.495663
H  -2.208132 3.352187 -3.880093
H  -3.022848 5.384001 -1.634781
H  -3.406654 4.195603 -0.389732
H  -3.915785 3.927274 -2.046429
H  -1.564512 4.854584 0.715455
H  -0.174146 4.437488 2.523944
H  -3.930686 -0.029204 0.843625
H  -0.947551 -2.154874 -0.00707
H  2.88075 1.230442 1.512426
H  -5.214693 -1.849455 0.233008
H  -5.420399 -4.168819 -0.598462
H  -3.395836 -5.487823 -1.11467
H  -0.378622 -4.447026 1.652386
H  1.12405 -4.386505 -2.35509
H  1.899481 -4.092563 2.512556
H  3.417788 -4.051292 -1.485948
H  3.809555 -3.90014 0.95166
totalener: -2033.55976346 hartree
nucrepener: 4641.96050583 hartree
electener: -6675.52026929 hartree
twoeener: 5355.43093490 hartree
kineticenergy: 2025.84821710 hartree
xcener: -182.497490315396 hartree
chargesum: 0.0000000
charge: -0.157788 -0.154240 -0.163034 -0.161561 -0.164387 -0.171139 -0.264619 -0.373653 -0.276419 -0.336983 -0.295707 -0.002840 0.106083 0.001373 -0.066081 -0.238387 -0.283833 -0.110933 0.318635 -0.223719 0.339317 0.439698 0.063403 -0.274428 -0.187455 -0.004145 -0.167200 0.235161 -0.084614 0.484204 0.505846 -0.214950 0.254234 -0.177316 -0.201262 -0.098352 -0.092668 -0.152217 0.096614 0.090270 0.078710 0.091357 0.094506 0.097759 0.102975 0.090599 0.123679 0.122502 0.105488 0.108856 0.141247 0.111609 0.127175 0.128751 0.133884 0.123566 0.130477 0.125110 0.126841
qa: -0.1578 -0.1542 -0.1630 -0.1616 -0.1644 -0.1711 -0.2646 -0.3737 -0.2764 -0.3370 -0.2957 -0.0028 0.1061 0.0014 -0.0661 -0.2384 -0.2838 -0.1109 0.3186 -0.2237 0.3393 0.4397 0.0634 -0.2744 -0.1875 -0.0041 -0.1672 0.2352 -0.0846 0.4842 0.5058 -0.2149 0.2542 -0.1773 -0.2013 -0.0984 -0.0927 -0.1522 0.0966 0.0903 0.0787 0.0914 0.0945 0.0978 0.1030 0.0906 0.1237 0.1225 0.1055 0.1089 0.1412 0.1116 0.1272 0.1288 0.1339 0.1236 0.1305 0.1251 0.1268
va: 1.1568 1.1654 1.1471 1.1632 1.1519 1.1343 2.1645 2.1017 2.0744 2.1683 2.1202 3.1059 3.7778 3.8280 3.8551 3.9029 3.9073 3.8876 4.1620 3.9474 3.8477 4.1770 3.7073 3.9712 3.9998 3.9885 3.9830 3.8550 3.9679 4.4809 4.3768 4.0365 3.7716 3.9652 4.0449 3.9228 3.9091 3.9309 1.0273 1.0323 1.0076 1.0044 1.0044 0.9982 1.0177 1.0045 0.9953 1.0149 1.0278 1.0332 1.0527 1.0113 1.0003 1.0130 1.0035 1.0134 0.9988 0.9988 0.9996
dispcorr: -0.036052677 hartree
energy: -2033.595816135148
dipole: -37.18111 36.26320 -0.91791 0.56364 -0.28532 0.27832 -9.47218 7.66983 -1.80235
magnitude: 2.04169 au
magnitude: 5.18955 debye
