program: Orca
programVersion: 5.0.2
elementType: F F F F F F O O O O O N C C C C C C C C C C C C C C C C C C C C C C C C C C H H H H H H H H H H H H H H H H H H H H H
charge: 0
multiplicity: 1
keywords: wb97x-d3
keywords: def2-TZVPP
keywords: def2/J RIJCOSX
keywords: DEFGRID2
keywords: scfconv7
keywords: smallprint printgap noloewdin
keywords: NOSOSCF
formula: C26H21F6NO5
InChI: InChI=1/C26H21F6NO5/c1-24(2)18(11-12-20(34)38-23(25(27,28)29)26(30,31)32)21(24)22(35)37-19(14-33)15-7-6-10-17(13-15)36-16-8-4-3-5-9-16/h3-13,18-19,21,23H,1-2H3
59 atoms
F  3.15325 -0.375248 -2.090429
F  5.218785 0.222849 -2.233559
F  4.56774 -1.023585 -0.605182
F  5.422617 0.893471 1.196172
F  6.051959 2.139084 -0.444541
F  4.586722 2.859323 0.960524
O  -4.048229 0.93535 -1.377825
O  -3.799303 0.625784 0.821306
O  2.786687 0.934222 0.235881
O  1.494441 2.438518 -0.81357
O  -0.779507 -2.857707 -0.930186
N  -7.087213 0.065787 -0.12029
C  -2.397568 3.387386 0.879115
C  -1.310458 2.558462 0.247418
C  -2.752361 2.498869 -0.27973
C  -2.356489 4.864287 0.558606
C  -2.88487 3.113483 2.281994
C  -0.70615 1.417246 0.935045
C  -3.567014 1.273529 -0.158278
C  0.561107 0.989411 0.856327
C  -4.86233 -0.213652 -1.467563
C  1.600762 1.562429 -0.000599
C  -4.153619 -1.520862 -1.165247
C  -6.088299 -0.052113 -0.674028
C  -2.769211 -1.596563 -1.197415
C  3.873848 1.256838 -0.586011
C  -4.90038 -2.665742 -0.917996
C  -2.144996 -2.80639 -0.940073
C  -4.263239 -3.876791 -0.700612
C  4.219977 -0.002103 -1.383349
C  5.005465 1.781857 0.299921
C  -2.880274 -3.955143 -0.69952
C  -0.133006 -2.629026 0.248235
C  1.256748 -2.630306 0.192892
C  -0.787428 -2.405749 1.454064
C  1.989166 -2.429499 1.349487
C  -0.035848 -2.207635 2.605561
C  1.349133 -2.222021 2.56501
H  -0.650235 3.092636 -0.42025
H  -2.874211 2.994517 -1.235613
H  -3.3504 5.305765 0.646789
H  -1.994155 5.056735 -0.451683
H  -1.69501 5.386143 1.251318
H  -2.901123 2.065435 2.560013
H  -3.90019 3.492411 2.40431
H  -2.2470 3.642549 2.991329
H  -1.345484 0.848151 1.599334
H  0.854579 0.138982 1.456415
H  -5.175926 -0.226455 -2.516146
H  -2.151833 -0.731904 -1.404578
H  3.617345 2.048339 -1.300191
H  -5.981497 -2.619948 -0.882839
H  -4.85205 -4.764082 -0.511721
H  -2.373311 -4.891351 -0.506998
H  1.751784 -2.790865 -0.755659
H  -1.867359 -2.385647 1.512339
H  3.069037 -2.429008 1.298501
H  -0.549642 -2.041978 3.543527
H  1.925226 -2.068076 3.467054
totalener: -2033.56261003 hartree
nucrepener: 4489.96084583 hartree
electener: -6523.52345586 hartree
twoeener: 5202.72636590 hartree
kineticenergy: 2025.83387807 hartree
xcener: -182.503296501624 hartree
chargesum: -0.0000000
charge: -0.162908 -0.154204 -0.160080 -0.153199 -0.156793 -0.157357 -0.279419 -0.348794 -0.264386 -0.376458 -0.299120 0.002330 0.086847 0.015330 -0.076515 -0.235057 -0.247209 -0.153680 0.315938 -0.259824 0.409696 0.441415 -0.014463 -0.278889 -0.188369 0.003464 -0.152422 0.180507 -0.110872 0.488082 0.470160 -0.132322 0.314710 -0.216101 -0.207631 -0.110282 -0.156339 -0.131565 0.122613 0.090626 0.093622 0.077983 0.094284 0.100370 0.095862 0.092256 0.145430 0.131818 0.130019 0.123076 0.132171 0.120301 0.132352 0.132038 0.122346 0.134487 0.126597 0.129340 0.128183
qa: -0.1629 -0.1542 -0.1601 -0.1532 -0.1568 -0.1574 -0.2794 -0.3488 -0.2644 -0.3765 -0.2991 0.0023 0.0868 0.0153 -0.0765 -0.2351 -0.2472 -0.1537 0.3159 -0.2598 0.4097 0.4414 -0.0145 -0.2789 -0.1884 0.0035 -0.1524 0.1805 -0.1109 0.4881 0.4702 -0.1323 0.3147 -0.2161 -0.2076 -0.1103 -0.1563 -0.1316 0.1226 0.0906 0.0936 0.0780 0.0943 0.1004 0.0959 0.0923 0.1454 0.1318 0.1300 0.1231 0.1322 0.1203 0.1324 0.1320 0.1223 0.1345 0.1266 0.1293 0.1282
va: 1.1491 1.1651 1.1492 1.1646 1.1587 1.1576 2.1216 2.1286 2.1122 2.1223 2.1082 3.1090 3.7753 3.7345 3.8646 3.9080 3.9049 3.8682 4.1416 3.9355 3.9019 4.1773 3.7730 4.0450 4.0458 3.9286 3.9997 3.8936 3.9504 4.4652 4.5175 4.0160 3.7306 3.9844 3.8578 3.8878 3.9297 3.9000 1.0317 1.0321 1.0036 1.0090 1.0045 1.0212 1.0024 1.0008 0.9971 1.0067 0.9857 1.0199 1.0575 1.0196 1.0004 1.0055 1.0254 1.0132 1.0090 1.0011 1.0000
dispcorr: -0.036714123 hartree
energy: -2033.599324148689
dipole: -57.62417 57.53696 -0.08721 2.78225 -2.62974 0.15251 15.72883 -15.96828 -0.23946
magnitude: 0.29699 au
magnitude: 0.75489 debye
