program: Orca
programVersion: 5.0.2
elementType: F F F F F F O O O O O N C C C C C C C C C C C C C C C C C C C C C C C C C C H H H H H H H H H H H H H H H H H H H H H
charge: 0
multiplicity: 1
keywords: wb97x-d3
keywords: def2-TZVPP
keywords: def2/J RIJCOSX
keywords: DEFGRID2
keywords: scfconv7
keywords: smallprint printgap noloewdin
keywords: NOSOSCF
formula: C26H21F6NO5
InChI: InChI=1/C26H21F6NO5/c1-24(2)18(11-12-20(34)38-23(25(27,28)29)26(30,31)32)21(24)22(35)37-19(14-33)15-7-6-10-17(13-15)36-16-8-4-3-5-9-16/h3-13,18-19,21,23H,1-2H3
59 atoms
F  3.832063 4.856273 -1.916242
F  5.910741 5.031443 -1.366351
F  5.349214 3.950031 -3.141071
F  6.541558 1.65459 -2.092124
F  7.076022 2.732807 -0.304296
F  5.797562 1.001635 -0.184431
O  -3.560932 0.113296 -0.059311
O  -2.135515 -0.655324 -1.602107
O  3.839493 2.177486 -1.637187
O  2.628192 2.206551 0.251155
O  -4.043872 -4.560722 1.83046
N  -6.753435 0.981556 -0.11007
C  -0.227337 -0.58912 0.927226
C  0.130015 0.627834 0.113817
C  -1.325013 0.332804 0.441445
C  0.074939 -0.524128 2.40452
C  -0.061419 -1.97358 0.350081
C  0.689455 0.502153 -1.235359
C  -2.323287 -0.124252 -0.543001
C  1.835135 1.032827 -1.683263
C  -4.648348 -0.408532 -0.794378
C  2.751702 1.851101 -0.888088
C  -4.891961 -1.880818 -0.523322
C  -5.817397 0.37966 -0.393981
C  -4.322477 -2.502915 0.579235
C  4.840951 2.951698 -1.036118
C  -5.717652 -2.58386 -1.385741
C  -4.583048 -3.848358 0.808634
C  -5.979256 -3.922313 -1.136779
C  4.998906 4.211879 -1.887544
C  6.090946 2.077355 -0.916515
C  -5.417442 -4.559453 -0.046448
C  -3.315377 -3.959123 2.818181
C  -1.993744 -4.349164 2.973893
C  -3.890302 -3.042188 3.688628
C  -1.244621 -3.824569 4.016747
C  -3.127005 -2.514173 4.718597
C  -1.805116 -2.902774 4.888245
H  0.527804 1.447207 0.694966
H  -1.746481 0.979173 1.202255
H  -0.027262 0.486949 2.799186
H  1.098184 -0.85081 2.596083
H  -0.596868 -1.176293 2.964508
H  -0.2974 -2.051033 -0.707378
H  -0.701625 -2.677771 0.88408
H  0.971088 -2.299288 0.48414
H  0.132178 -0.092231 -1.947466
H  2.130468 0.842559 -2.706333
H  -4.495892 -0.262358 -1.869584
H  -3.683453 -1.948289 1.252635
H  4.554917 3.264347 -0.024919
H  -6.159036 -2.094272 -2.244797
H  -6.624569 -4.477667 -1.803709
H  -5.610946 -5.605985 0.147484
H  -1.567051 -5.073102 2.291961
H  -4.926379 -2.751616 3.569272
H  -0.216427 -4.136658 4.143589
H  -3.574026 -1.801436 5.398666
H  -1.217968 -2.49387 5.699373
totalener: -2033.56537364 hartree
nucrepener: 4179.63740846 hartree
electener: -6213.20278211 hartree
twoeener: 4891.88160939 hartree
kineticenergy: 2025.82980695 hartree
xcener: -182.500729155525 hartree
chargesum: 0.0000000
charge: -0.158902 -0.156571 -0.150982 -0.151250 -0.156366 -0.159935 -0.275459 -0.374560 -0.271611 -0.376261 -0.290329 0.003127 0.100386 -0.006132 -0.073593 -0.216605 -0.254081 -0.131541 0.317647 -0.263048 0.301259 0.444811 0.068376 -0.254229 -0.226062 0.017852 -0.214284 0.309281 -0.064171 0.470934 0.470027 -0.224580 0.291806 -0.250741 -0.202289 -0.101690 -0.084369 -0.148582 0.118040 0.096595 0.081899 0.094342 0.068127 0.103639 0.080110 0.101739 0.150695 0.125397 0.131500 0.121468 0.126677 0.111547 0.127935 0.127415 0.136594 0.138682 0.131149 0.134565 0.134601
qa: -0.1589 -0.1566 -0.1510 -0.1512 -0.1564 -0.1599 -0.2755 -0.3746 -0.2716 -0.3763 -0.2903 0.0031 0.1004 -0.0061 -0.0736 -0.2166 -0.2541 -0.1315 0.3176 -0.2630 0.3013 0.4448 0.0684 -0.2542 -0.2261 0.0179 -0.2143 0.3093 -0.0642 0.4709 0.4700 -0.2246 0.2918 -0.2507 -0.2023 -0.1017 -0.0844 -0.1486 0.1180 0.0966 0.0819 0.0943 0.0681 0.1036 0.0801 0.1017 0.1507 0.1254 0.1315 0.1215 0.1267 0.1115 0.1279 0.1274 0.1366 0.1387 0.1311 0.1346 0.1346
va: 1.1546 1.1595 1.1681 1.1678 1.1597 1.1534 2.1071 2.1066 2.1152 2.1201 2.1329 3.1231 3.7632 3.7720 3.8833 3.9128 3.9025 3.8858 4.1677 3.9664 3.8220 4.1456 3.7473 3.9958 3.9716 3.9098 4.0722 3.7781 3.9414 4.5181 4.5151 4.0432 3.7198 3.9909 3.9829 3.8489 3.8911 3.9022 1.0356 1.0311 1.0144 1.0059 1.0121 1.0199 1.0159 1.0023 1.0094 1.0172 1.0193 1.0214 1.0575 1.0116 0.9988 1.0141 1.0101 1.0035 0.9992 0.9974 0.9992
dispcorr: -0.033164712 hartree
energy: -2033.598538355589
dipole: -62.22760 62.34006 0.11246 -48.03147 46.59949 -1.43198 29.04889 -28.38046 0.66843
magnitude: 1.58430 au
magnitude: 4.02698 debye
