program: Orca
programVersion: 5.0.2
elementType: F F F F F F O O O O O N C C C C C C C C C C C C C C C C C C C C C C C C C C H H H H H H H H H H H H H H H H H H H H H
charge: 0
multiplicity: 1
keywords: wb97x-d3
keywords: def2-TZVPP
keywords: def2/J RIJCOSX
keywords: DEFGRID2
keywords: scfconv7
keywords: smallprint printgap noloewdin
keywords: NOSOSCF
formula: C26H21F6NO5
InChI: InChI=1/C26H21F6NO5/c1-24(2)18(11-12-20(34)38-23(25(27,28)29)26(30,31)32)21(24)22(35)37-19(14-33)15-7-6-10-17(13-15)36-16-8-4-3-5-9-16/h3-13,18-19,21,23H,1-2H3
59 atoms
F  1.579875 -0.802558 -1.523842
F  3.518206 -0.816999 -2.462168
F  3.319397 -1.343274 -0.384148
F  5.025927 0.769283 0.299572
F  5.197419 1.269024 -1.789085
F  4.426353 2.713532 -0.388119
O  -3.624491 0.97633 -0.869321
O  -2.534506 0.534785 1.027876
O  2.309994 1.1322 0.243765
O  0.682744 2.304893 -0.770812
O  -0.249089 -3.566993 -0.295433
N  -5.244534 -1.377382 1.032872
C  -2.815208 3.671527 1.323695
C  -1.408417 3.306056 0.990676
C  -2.541271 2.75803 0.137295
C  -3.264065 5.06611 0.961539
C  -3.483557 3.138084 2.565194
C  -0.594141 2.446026 1.871796
C  -2.86515 1.325006 0.181368
C  0.562842 1.845462 1.571039
C  -3.976721 -0.39378 -1.031289
C  1.138837 1.821719 0.230624
C  -2.812353 -1.239427 -1.491522
C  -4.652022 -0.929111 0.156707
C  -2.095031 -2.0472 -0.619048
C  3.008695 0.94897 -0.959051
C  -2.455538 -1.164323 -2.833219
C  -0.997677 -2.754146 -1.091876
C  -1.378676 -1.903288 -3.29769
C  2.871379 -0.526981 -1.335388
C  4.439546 1.419134 -0.704236
C  -0.641936 -2.694789 -2.432568
C  -0.084005 -3.295849 1.037221
C  -0.11648 -4.379498 1.903044
C  0.168418 -2.014354 1.514301
C  0.10585 -4.180287 3.258027
C  0.373245 -1.829476 2.873738
C  0.344199 -2.905213 3.750854
H  -0.833139 4.061751 0.465392
H  -2.659613 3.213543 -0.838759
H  -4.339598 5.095904 0.77868
H  -2.762036 5.438026 0.067592
H  -3.046119 5.758362 1.777086
H  -4.567185 3.134739 2.435692
H  -3.258132 3.78805 3.412824
H  -3.186024 2.128835 2.840132
H  -0.931495 2.337379 2.896785
H  1.093905 1.305778 2.344054
H  -4.732657 -0.376359 -1.820449
H  -2.385053 -2.127699 0.420333
H  2.599193 1.549025 -1.780659
H  -3.020071 -0.53991 -3.514554
H  -1.103572 -1.857493 -4.343097
H  0.204782 -3.265587 -2.792384
H  -0.309855 -5.372173 1.516007
H  0.201903 -1.164048 0.845821
H  0.08286 -5.028377 3.930106
H  0.563758 -0.831579 3.247213
H  0.508239 -2.750412 4.809101
elementType: F O N C H
totalener: -2033.58669241 hartree
nucrepener: 4623.35600946 hartree
electener: -6656.94270186 hartree
twoeener: 5337.90615138 hartree
cpcmener: -0.04147022 hartree
kineticenergy: 2025.76937760 hartree
xcener: -182.493646927603 hartree
chargesum: -0.0000000
charge: -0.167627 -0.164926 -0.168735 -0.163109 -0.163754 -0.165497 -0.281129 -0.446751 -0.277260 -0.429970 -0.323973 -0.083887 0.114861 -0.040255 -0.102606 -0.255491 -0.288475 -0.054283 0.427652 -0.316628 0.469982 0.498291 -0.030268 -0.253136 -0.166980 0.039440 -0.242947 0.276733 -0.096673 0.503242 0.478631 -0.269996 0.301816 -0.244100 -0.208128 -0.119385 -0.131089 -0.192383 0.112795 0.097663 0.098093 0.089375 0.095946 0.103072 0.105379 0.092459 0.157086 0.148683 0.145028 0.138368 0.147298 0.143165 0.158560 0.146389 0.144485 0.144312 0.156738 0.158328 0.155573
qa: -0.1676 -0.1649 -0.1687 -0.1631 -0.1638 -0.1655 -0.2811 -0.4468 -0.2773 -0.4300 -0.3240 -0.0839 0.1149 -0.0403 -0.1026 -0.2555 -0.2885 -0.0543 0.4277 -0.3166 0.4700 0.4983 -0.0303 -0.2531 -0.1670 0.0394 -0.2429 0.2767 -0.0967 0.5032 0.4786 -0.2700 0.3018 -0.2441 -0.2081 -0.1194 -0.1311 -0.1924 0.1128 0.0977 0.0981 0.0894 0.0959 0.1031 0.1054 0.0925 0.1571 0.1487 0.1450 0.1384 0.1473 0.1432 0.1586 0.1464 0.1445 0.1443 0.1567 0.1583 0.1556
va: 1.1462 1.1529 1.1421 1.1513 1.1515 1.1465 2.1477 2.0369 2.1122 2.0773 2.0908 3.1061 3.7851 3.8115 3.9053 3.8945 3.9092 3.8130 4.0765 3.9058 3.8341 4.0847 3.6446 4.0658 3.8841 3.9052 4.0103 3.7571 3.8734 4.4331 4.5164 3.9856 3.7127 4.0076 3.8878 3.8831 3.8960 3.9509 1.0201 1.0284 1.0021 1.0047 1.0020 1.0009 0.9982 1.0162 0.9820 1.0060 0.9921 1.0208 1.0450 1.0041 0.9882 1.0076 1.0085 0.9895 0.9889 0.9905 0.9924
dispcorr: -0.037039053 hartree
energy: -2033.623731459556
dipole: -51.35320 51.04371 -0.30949 12.02980 -9.79731 2.23250 21.33245 -22.11122 -0.77877
magnitude: 2.38460 au
magnitude: 6.06117 debye
