program: Orca
programVersion: 5.0.2
elementType: F F F F F F O O O O O N C C C C C C C C C C C C C C C C C C C C C C C C C C H H H H H H H H H H H H H H H H H H H H H
charge: 0
multiplicity: 1
keywords: wb97x-d3
keywords: def2-TZVPP
keywords: def2/J RIJCOSX
keywords: DEFGRID2
keywords: scfconv7
keywords: smallprint printgap noloewdin
keywords: NOSOSCF
formula: C26H21F6NO5
InChI: InChI=1/C26H21F6NO5/c1-24(2)18(11-12-20(34)38-23(25(27,28)29)26(30,31)32)21(24)22(35)37-19(14-33)15-7-6-10-17(13-15)36-16-8-4-3-5-9-16/h3-13,18-19,21,23H,1-2H3
59 atoms
F  2.482925 0.870627 -2.83381
F  4.490196 1.455257 -3.353925
F  4.157105 -0.038138 -1.840489
F  4.759271 3.565066 0.232898
F  5.544403 1.583285 -0.038093
F  5.804112 3.062559 -1.580388
O  -2.90508 0.795003 -1.172767
O  -2.961369 0.281242 0.995247
O  2.810584 1.741536 -0.240955
O  1.086155 3.017689 -0.896896
O  -0.901412 -4.47038 0.719598
N  -5.320054 -1.529379 -0.720791
C  -2.558429 3.285297 1.597864
C  -1.234504 2.973832 0.961275
C  -2.551978 2.55032 0.287888
C  -3.000883 4.728029 1.501513
C  -2.99519 2.639068 2.889994
C  -0.326734 1.94928 1.49138
C  -2.831543 1.110672 0.134609
C  0.899176 1.634873 1.050756
C  -3.009542 -0.582781 -1.496887
C  1.547021 2.227178 -0.117795
C  -1.810215 -1.381339 -1.026325
C  -4.294254 -1.115268 -1.027915
C  -1.957847 -2.585351 -0.355137
C  3.615879 2.213521 -1.289988
C  -0.54196 -0.875051 -1.29247
C  -0.829144 -3.269205 0.080426
C  0.573753 -1.574368 -0.860263
C  3.700655 1.107809 -2.341809
C  4.956278 2.600423 -0.664212
C  0.439514 -2.765602 -0.164964
C  -1.926128 -4.762443 1.579181
C  -2.364656 -6.079282 1.596091
C  -2.470077 -3.823475 2.44792
C  -3.353996 -6.459841 2.490844
C  -3.468596 -4.216831 3.327603
C  -3.91515 -5.530781 3.355746
H  -0.756426 3.793414 0.442222
H  -2.792202 3.132395 -0.594324
H  -2.69265 5.191535 0.563639
H  -2.574327 5.313213 2.317822
H  -4.087439 4.803503 1.569206
H  -2.649572 3.246993 3.728127
H  -2.632255 1.627814 3.04652
H  -4.084876 2.602928 2.939506
H  -0.667873 1.385552 2.352016
H  1.45765 0.871119 1.575912
H  -3.050185 -0.599528 -2.589222
H  -2.94325 -2.989901 -0.159538
H  3.197631 3.105362 -1.77022
H  -0.416569 0.060154 -1.823426
H  1.563522 -1.185158 -1.055682
H  1.31165 -3.305438 0.181436
H  -1.927422 -6.800817 0.917218
H  -2.129099 -2.795517 2.446506
H  -3.69052 -7.488514 2.504119
H  -3.895247 -3.484192 4.000511
H  -4.69212 -5.828192 4.047491
elementType: F O N C H
totalener: -2033.58632404 hartree
nucrepener: 4389.22604554 hartree
electener: -6422.81236958 hartree
twoeener: 5102.23692267 hartree
cpcmener: -0.03842866 hartree
kineticenergy: 2025.76020501 hartree
xcener: -182.492778345125 hartree
chargesum: -0.0000000
charge: -0.167985 -0.161943 -0.168900 -0.165184 -0.162522 -0.162670 -0.284241 -0.430694 -0.273271 -0.430251 -0.323854 -0.075780 0.125368 -0.072794 -0.039921 -0.258780 -0.279243 -0.057905 0.375280 -0.327977 0.509330 0.507223 0.000197 -0.266164 -0.207154 0.032728 -0.319717 0.301663 -0.083458 0.499474 0.479464 -0.252906 0.306135 -0.261260 -0.208205 -0.114120 -0.137648 -0.190259 0.110405 0.100642 0.090494 0.097888 0.098069 0.099144 0.092992 0.104489 0.166732 0.139065 0.146557 0.136924 0.146974 0.143045 0.155918 0.144933 0.144977 0.155287 0.157230 0.159210 0.156968
qa: -0.1680 -0.1619 -0.1689 -0.1652 -0.1625 -0.1627 -0.2842 -0.4307 -0.2733 -0.4303 -0.3239 -0.0758 0.1254 -0.0728 -0.0399 -0.2588 -0.2792 -0.0579 0.3753 -0.3280 0.5093 0.5072 0.0002 -0.2662 -0.2072 0.0327 -0.3197 0.3017 -0.0835 0.4995 0.4795 -0.2529 0.3061 -0.2613 -0.2082 -0.1141 -0.1376 -0.1903 0.1104 0.1006 0.0905 0.0979 0.0981 0.0991 0.0930 0.1045 0.1667 0.1391 0.1466 0.1369 0.1470 0.1430 0.1559 0.1449 0.1450 0.1553 0.1572 0.1592 0.1570
va: 1.1406 1.1570 1.1404 1.1473 1.1521 1.1528 2.1321 2.0604 2.1176 2.0661 2.0900 3.1072 3.8018 3.7976 3.8805 3.8955 3.8919 3.7879 4.1003 3.9568 3.8106 4.0502 3.6991 4.1154 3.8977 3.9066 3.9534 3.7698 3.8243 4.4468 4.5179 4.0740 3.6778 4.0155 3.9070 3.8798 3.8876 3.9138 1.0286 1.0293 1.0044 1.0025 1.0024 1.0005 1.0188 0.9994 0.9830 1.0140 0.9895 1.0152 1.0431 1.0197 0.9972 1.0081 1.0091 1.0017 0.9891 0.9903 0.9908
dispcorr: -0.034465593 hartree
energy: -2033.620789630750
dipole: -61.14701 61.61111 0.46410 -9.31858 10.98735 1.66877 31.92090 -31.67734 0.24355
magnitude: 1.74914 au
magnitude: 4.44597 debye
