program: Gaussian 09
title: 000060789
version: EM64L-G09RevD.01
frameworkgroup: C1[X(C18H23NO4)]
method: RPBEPBE
basis: SDD
operation: Freq
keyword: #p
keyword: freq=noraman
keyword: PBEPBE/SDD
title: #p freq=noraman PBEPBE/SDD
converged: YES YES NO NO
title: Mulliken charges:
elementType: O O O O N C C C C C C C C C C C C C C C C C C H H H H H H H H H H H H H H H H H H H H H H H
charge: -0.472743 -0.492934 -0.429426 -0.437357 -0.278318 -0.377470 -0.371040 -0.373372 -0.367801 -0.569297 -0.272711 0.516953 0.511267 -0.527718 -0.465568 -0.399583 -0.386736 0.185522 -0.310582 -0.387320 -0.350205 0.131646 0.276822 0.215025 0.181568 0.206014 0.204225 0.176191 0.204967 0.221027 0.197765 0.206686 0.203245 0.225386 0.269445 0.262136 0.239479 0.231300 0.233828 0.346136 0.252031 0.215043 0.247345 0.374178 0.383988 0.350960
chargesum: 0.00000
title: Mulliken charges with hydrogens summed into heavy atoms:
elementType: O O O O N C C C C C C C C C C C C C C C C C C
charge: -0.126607 -0.118756 -0.045438 -0.086398 -0.008873 0.019123 0.039200 0.007787 0.050991 -0.159366 -0.047325 0.516953 0.511267 -0.265582 -0.226088 -0.168283 -0.152908 0.185522 -0.058551 -0.172276 -0.102860 0.131646 0.276822
polarizability: 2.97036365e+02 3.12238145e+00 1.69558501e+02 -8.68341925e+00 -1.80888612e+01 1.95482530e+02
1716.lowfreq: -3.4061 -1.8933 -0.0007 0.0008 0.0011 7.7459 12.1717 17.4491 18.2926
frequency: 12.0860 17.3699 18.2211 24.1932 38.4349 47.0952 79.9528 81.0603 99.5320 128.6621 134.3434 145.8452 158.1031 195.8246 207.4323 236.2153 259.9195 279.9461 284.6637 297.0192 299.3310 344.9209 346.6153 354.5265 379.9088 401.8310 409.5690 414.6519 434.6348 444.0101 459.4804 488.7157 497.2262 529.6061 546.7862 558.9236 589.1887 623.8715 636.6793 716.3284 719.5418 732.4543 740.7378 743.2962 756.7336 778.3295 791.2867 806.8584 820.3681 824.3070 838.3027 854.4878 856.6819 909.1592 930.6458 939.1054 953.2977 959.4537 990.8262 1003.6817 1013.6310 1020.2834 1038.0933 1058.1815 1071.9818 1073.8137 1092.5681 1115.6460 1124.4215 1142.6184 1144.2692 1150.7276 1157.8896 1177.9750 1178.7701 1202.9303 1214.9077 1225.8884 1234.1062 1241.1331 1245.3371 1255.2488 1266.7087 1280.6379 1283.3171 1292.9572 1310.3058 1319.3500 1324.2377 1337.3826 1342.5835 1357.8404 1390.3951 1391.7030 1418.3271 1425.0780 1433.8918 1451.8599 1463.8587 1466.5145 1469.9052 1484.5949 1496.5947 1504.1605 1517.7160 1597.7652 1615.5439 1623.6817 1627.2526 2838.1246 2856.8658 2956.4781 2966.8648 2974.2854 2976.4434 2985.6472 3006.2645 3017.6601 3026.9334 3048.3953 3106.8047 3122.1810 3124.0230 3132.0764 3133.9884 3168.1935 3172.2615 3435.4106 3524.4239 3567.1663 3582.9966 3621.9742
redmass: 4.7407 4.7640 5.0561 3.9791 3.9816 6.1191 2.8405 5.8243 1.9686 3.4408 3.9952 4.3945 3.1284 3.7433 4.7201 4.6569 4.0129 4.0034 1.3488 2.7579 2.4395 1.3854 1.6319 1.9517 5.1344 3.2203 3.0262 3.7469 3.5278 3.9331 3.5718 1.1301 3.4621 3.5461 3.2348 4.7410 6.0795 4.1704 6.7493 3.1853 3.3511 1.6394 1.7974 1.5906 4.0737 4.6199 1.1900 1.4356 1.3973 2.8468 1.9375 2.1918 1.7708 1.3248 1.3766 1.3642 3.2432 1.3657 3.3285 2.8212 2.8416 3.1002 2.3428 1.6502 2.3101 2.1053 2.4987 1.3588 1.3829 1.3921 1.3719 1.3825 3.0660 1.1150 1.3099 1.4373 2.1090 2.2909 1.2925 1.3208 2.8884 1.5596 1.2720 1.0600 1.1845 1.4477 1.5388 1.2893 1.5254 1.5352 1.4583 1.5836 6.0829 1.5362 3.6330 2.8161 4.3924 1.2056 1.0883 1.0765 1.0913 1.0981 1.0936 2.7851 3.3456 6.4402 6.5494 7.2909 6.4888 1.0714 1.0704 1.0642 1.0596 1.0845 1.0612 1.0819 1.0979 1.0882 1.1013 1.1041 1.0874 1.0898 1.0913 1.0898 1.0960 1.0951 1.0951 1.0738 1.0649 1.0661 1.0660 1.0666
irintensity: 0.2720 0.3702 0.0613 0.3871 1.0329 0.1407 1.2829 0.1309 0.6317 1.2283 0.6792 1.4621 3.8040 3.5017 6.6389 0.8980 12.0865 24.5530 144.7374 6.0734 30.4981 159.9937 7.1278 113.9818 2.3242 11.5407 3.1287 3.8470 7.1812 3.4726 19.2800 118.2230 20.8072 8.5853 21.7643 1.2259 39.3517 27.6572 0.7754 14.1267 13.7072 83.4292 25.9748 9.1187 14.8718 12.0418 0.6433 27.6664 40.7025 9.8596 36.5284 10.2356 38.4583 0.7755 0.1687 0.2301 13.1612 0.1628 28.9153 5.5761 13.3221 20.1264 25.2505 10.4696 148.3601 5.1238 11.9738 40.1359 21.3522 146.0005 105.8075 12.3795 68.7068 19.7930 204.0385 7.9536 1.7612 98.5665 51.3236 8.1696 23.3614 39.5826 17.7140 0.3844 1.4529 49.9754 20.9161 11.4306 10.5276 19.5394 1.3385 3.7666 13.5912 14.4284 19.1332 13.0896 53.5131 78.1919 12.6678 0.0845 0.5555 7.3146 8.1758 106.3306 86.5692 9.0387 17.2977 20.6398 24.9000 89.8793 116.5486 13.1069 1.5345 38.2490 61.9827 58.9680 1.6693 28.3020 2.3746 93.7941 21.1712 20.1901 6.5514 8.1541 16.4883 7.1415 6.6633 3.7087 89.0084 6.2727 36.4901 48.9006
temp: 298.150 k
press: 1.00000 atm
elementType: 8 8 8 8 7 6 6 6 6 6 6 6 6 6 6 6 6 6 6 6 6 6 6 1 1 1 1 1 1 1 1 1 1 1 1 1 1 1 1 1 1 1 1 1 1 1
symmnumber: 1
zpe: 988069.5 jmol-1
zpe.correction: 0.376336 hartree
zpe.thermalcorrener: 0.400003 hartree
zpe.thermalcorrenthalpy: 0.400947 hartree
zpe.thermalcorrgfe: 0.318664 hartree
zpe.sumelectzpe: -1053.611904 hartree
zpe.sumelectthermal: -1053.588237 hartree
zpe.sumelectthermalent: -1053.587292 hartree
zpe.sumelectthermalfe: -1053.669576 hartree
dipole: -0.2742 0.7570 -3.7094
dipole: 3.7958
quadrupole: -151.9731 -132.7592 -126.9777
quadrupole: 4.8203 -0.2805 -10.5969
quadrupole: -14.7364 4.4775 10.2589 4.8203 -0.2805 -10.5969
hfenergy: -1053.9882395 hartree
pointgroup: C01 [X(C18H23N1O4)]
dipole: 0.0966788 -0.3033432 -1.4590421 debye
polarizability: 297.1819254|2.1281154|169.6266528|8.2388216|18.0803685|195.268818 unknown
InChI: InChI=1S/C18H23NO4/c20-15-7-4-13(5-8-15)3-1-2-10-19-12-18(23)14-6-9-16(21)17(22)11-14/h4-9,11,18-23H,1-3,10,12H2
charge 0 multiplicity 1
46 atoms
O  3.1457 1.617463 -1.654363
O  6.899746 -2.078223 -1.384829
O  8.229865 -1.475617 0.881987
O  -9.134798 -1.675439 0.504957
N  0.807721 1.100885 -0.16707
C  -1.678578 1.2050 -0.205719
C  -3.00227 0.433302 -0.016056
C  -0.434589 0.328719 0.038103
C  2.048956 0.337147 0.040241
C  -4.254374 1.315997 -0.277651
C  3.270539 1.234484 -0.22312
C  -5.559606 0.554734 -0.099619
C  4.593801 0.540401 0.059385
C  5.09087 -0.432922 -0.848273
C  5.331686 0.831449 1.231622
C  -6.196194 -0.075591 -1.197626
C  -6.156149 0.413696 1.182153
C  6.295394 -1.094701 -0.564894
C  6.543217 0.15967 1.515401
C  -7.383127 -0.824137 -1.031713
C  -7.339579 -0.328092 1.369463
C  7.030375 -0.808155 0.618135
C  -7.952538 -0.949486 0.257557
H  -1.639413 2.073935 0.480178
H  -1.639352 1.61567 -1.23762
H  -3.055602 0.027139 1.014377
H  -3.030295 -0.441893 -0.696679
H  -0.492277 -0.579132 -0.617801
H  -0.444287 -0.040176 1.084188
H  2.08956 -0.01731 1.088284
H  2.13345 -0.566694 -0.615915
H  -4.221945 2.184674 0.409858
H  -4.189443 1.723177 -1.306194
H  3.17426 2.139773 0.412439
H  0.830779 1.561015 -1.088601
H  4.530211 -0.642433 -1.768044
H  4.959124 1.587276 1.932766
H  -5.761546 0.021624 -2.200131
H  -5.688344 0.89752 2.048651
H  3.900354 2.214557 -1.888566
H  7.121471 0.376498 2.418151
H  -7.860828 -1.299905 -1.898778
H  -7.801318 -0.432864 2.35586
H  6.362755 -2.266778 -2.190858
H  8.407829 -2.114997 0.142419
H  -9.484314 -2.068758 -0.332753
