program: Orca
programVersion: 5.0.2
elementType: F F F F F F O O O O O N C C C C C C C C C C C C C C C C C C C C C C C C C C H H H H H H H H H H H H H H H H H H H H H
charge: 0
multiplicity: 1
keywords: wb97x-d3
keywords: def2-TZVPP
keywords: def2/J RIJCOSX
keywords: DEFGRID2
keywords: scfconv7
keywords: smallprint printgap noloewdin
keywords: NOSOSCF
formula: C26H21F6NO5
InChI: InChI=1/C26H21F6NO5/c1-24(2)18(11-12-20(34)38-23(25(27,28)29)26(30,31)32)21(24)22(35)37-19(14-33)15-7-6-10-17(13-15)36-16-8-4-3-5-9-16/h3-13,18-19,21,23H,1-2H3
59 atoms
F  3.230487 1.859239 -4.140128
F  2.910113 -0.008621 -3.11794
F  1.305903 1.408786 -3.287551
F  4.74801 2.516779 -0.315792
F  4.869694 0.581907 -1.240539
F  5.264282 2.354352 -2.399117
O  -2.182773 0.740721 -0.167411
O  -3.310785 2.177478 -1.448163
O  2.318695 1.336686 -0.743323
O  0.893495 3.062071 -0.55327
O  -0.12531 -3.657728 1.748877
N  -4.770459 -1.335451 -0.735689
C  -2.528695 2.920421 1.994472
C  -1.119398 2.813138 1.517295
C  -2.238155 2.991055 0.50201
C  -2.942064 4.231204 2.6200
C  -3.245019 1.734185 2.589523
C  -0.327983 1.571074 1.654464
C  -2.644843 1.959663 -0.468492
C  0.76264 1.22187 0.963585
C  -2.384505 -0.322627 -1.08703
C  1.284271 1.996616 -0.157071
C  -1.292981 -1.328919 -0.828464
C  -3.723036 -0.889689 -0.88864
C  -1.292238 -2.069075 0.349601
C  3.014395 1.967293 -1.7871
C  -0.247148 -1.429423 -1.732692
C  -0.230919 -2.924227 0.608296
C  0.812022 -2.283977 -1.455426
C  2.620639 1.291669 -3.102076
C  4.497326 1.844368 -1.438633
C  0.823825 -3.03398 -0.293634
C  -1.243505 -3.982508 2.476002
C  -1.25818 -3.648472 3.82111
C  -2.295998 -4.683398 1.901435
C  -2.338423 -4.031852 4.604805
C  -3.374243 -5.049641 2.693362
C  -3.399824 -4.72828 4.044607
H  -0.520644 3.71355 1.61709
H  -2.318511 3.981385 0.069377
H  -2.713924 4.231669 3.687565
H  -4.01494 4.39719 2.50866
H  -2.424549 5.079508 2.170145
H  -4.321225 1.829627 2.437498
H  -3.069063 1.701896 3.666436
H  -2.942989 0.771241 2.18474
H  -0.638544 0.881128 2.43224
H  1.267791 0.294994 1.203061
H  -2.32515 0.032767 -2.119521
H  -2.106605 -1.971751 1.058413
H  2.769879 3.032979 -1.870157
H  -0.259027 -0.848495 -2.645378
H  1.630956 -2.376228 -2.155688
H  1.645848 -3.7052 -0.078511
H  -0.427516 -3.103398 4.251924
H  -2.274082 -4.948636 0.851416
H  -2.34875 -3.778102 5.656989
H  -4.195551 -5.598011 2.250386
H  -4.241523 -5.02379 4.657265
elementType: F O N C H
totalener: -2033.58630520 hartree
nucrepener: 4503.92201324 hartree
electener: -6537.50831844 hartree
twoeener: 5216.29900974 hartree
cpcmener: -0.04027588 hartree
kineticenergy: 2025.76631881 hartree
xcener: -182.489130235577 hartree
chargesum: 0.0000000
charge: -0.162388 -0.166619 -0.168232 -0.166050 -0.163329 -0.163084 -0.252444 -0.438530 -0.278741 -0.429696 -0.324802 -0.081244 0.111911 -0.025178 -0.129003 -0.261050 -0.274267 -0.056503 0.416232 -0.295053 0.367107 0.498583 0.059358 -0.227120 -0.238639 0.041688 -0.239785 0.281755 -0.091063 0.492844 0.477295 -0.246119 0.271117 -0.233729 -0.188995 -0.129224 -0.140992 -0.172486 0.112381 0.099552 0.095437 0.098378 0.088793 0.106131 0.103855 0.079356 0.157759 0.139991 0.128595 0.141337 0.148969 0.141967 0.157252 0.146823 0.146464 0.156719 0.158273 0.159596 0.158846
qa: -0.1624 -0.1666 -0.1682 -0.1660 -0.1633 -0.1631 -0.2524 -0.4385 -0.2787 -0.4297 -0.3248 -0.0812 0.1119 -0.0252 -0.1290 -0.2610 -0.2743 -0.0565 0.4162 -0.2951 0.3671 0.4986 0.0594 -0.2271 -0.2386 0.0417 -0.2398 0.2818 -0.0911 0.4928 0.4773 -0.2461 0.2711 -0.2337 -0.1890 -0.1292 -0.1410 -0.1725 0.1124 0.0996 0.0954 0.0984 0.0888 0.1061 0.1039 0.0794 0.1578 0.1400 0.1286 0.1413 0.1490 0.1420 0.1573 0.1468 0.1465 0.1567 0.1583 0.1596 0.1588
va: 1.1557 1.1424 1.1423 1.1464 1.1505 1.1528 2.1339 2.0730 2.1106 2.0781 2.0844 3.1075 3.7745 3.7842 3.9071 3.9050 3.9096 3.8153 4.1255 3.8977 3.8008 4.0669 3.6379 4.0439 3.9441 3.8935 3.9170 3.7508 3.8584 4.4572 4.5232 4.0169 3.6902 4.0084 3.9318 3.8833 3.8878 3.8993 1.0191 1.0257 1.0018 1.0018 1.0051 1.0014 0.9994 1.0096 0.9802 1.0095 1.0276 1.0078 1.0432 1.0138 0.9953 1.0069 1.0068 0.9972 0.9893 0.9899 0.9902
dispcorr: -0.036338328 hartree
energy: -2033.622643531348
dipole: -52.29658 53.34339 1.04681 -10.32743 10.49956 0.17212 44.40700 -42.38460 2.02240
magnitude: 2.28375 au
magnitude: 5.80484 debye
