program: Orca
programVersion: 5.0.2
elementType: F F F F F F O O O O O N C C C C C C C C C C C C C C C C C C C C C C C C C C H H H H H H H H H H H H H H H H H H H H H
charge: 0
multiplicity: 1
keywords: wb97x-d3
keywords: def2-TZVPP
keywords: def2/J RIJCOSX
keywords: DEFGRID2
keywords: scfconv7
keywords: smallprint printgap noloewdin
keywords: NOSOSCF
formula: C26H21F6NO5
InChI: InChI=1/C26H21F6NO5/c1-24(2)18(11-12-20(34)38-23(25(27,28)29)26(30,31)32)21(24)22(35)37-19(14-33)15-7-6-10-17(13-15)36-16-8-4-3-5-9-16/h3-13,18-19,21,23H,1-2H3
59 atoms
F  3.414812 4.988631 -2.118951
F  5.468941 5.613803 -1.908167
F  4.891781 4.311973 -3.524966
F  6.708558 2.414177 -2.563876
F  7.226091 3.706842 -0.92048
F  6.386767 1.75732 -0.545466
O  -2.961134 -0.01833 -0.015827
O  -1.507618 -0.903955 -1.457619
O  4.055718 2.37309 -1.769066
O  3.013242 2.308797 0.216237
O  -4.1150 -4.664126 1.83858
N  -6.184487 0.652738 0.086776
C  0.301454 -0.843868 1.135416
C  0.734993 0.343261 0.31037
C  -0.744286 0.103344 0.594477
C  0.552813 -0.747689 2.620435
C  0.438572 -2.250368 0.606981
C  1.317632 0.17266 -1.019644
C  -1.717154 -0.329029 -0.421434
C  2.355184 0.832407 -1.556898
C  -4.027366 -0.519604 -0.80824
C  3.123539 1.888629 -0.905286
C  -4.180528 -2.0193 -0.692373
C  -5.225703 0.148128 -0.294566
C  -4.080192 -2.618414 0.557476
C  4.916242 3.389003 -1.326721
C  -4.426888 -2.775115 -1.827704
C  -4.241021 -3.992633 0.661215
C  -4.579676 -4.149379 -1.707384
C  4.682321 4.591333 -2.239642
C  6.333252 2.81737 -1.351911
C  -4.491511 -4.76235 -0.469351
C  -4.441521 -4.071551 3.029923
C  -5.60714 -3.332691 3.19326
C  -3.589736 -4.298498 4.101134
C  -5.907499 -2.812466 4.443564
C  -3.911783 -3.785462 5.349799
C  -5.066498 -3.036243 5.525696
H  1.124932 1.168065 0.888617
H  -1.16239 0.785112 1.32566
H  -0.155778 -1.369663 3.17091
H  0.456202 0.274909 2.986048
H  1.559362 -1.095185 2.860273
H  1.457017 -2.604394 0.778321
H  0.227677 -2.364161 -0.453356
H  -0.237238 -2.916552 1.147666
H  0.877057 -0.581067 -1.658402
H  2.661751 0.570811 -2.561321
H  -3.912822 -0.23169 -1.858663
H  -3.876852 -2.019308 1.436909
H  4.700245 3.701973 -0.29815
H  -4.494454 -2.298588 -2.797322
H  -4.768596 -4.750343 -2.586925
H  -4.609805 -5.834398 -0.374167
H  -6.280574 -3.164514 2.361984
H  -2.687816 -4.880858 3.959572
H  -6.813836 -2.234428 4.570517
H  -3.249734 -3.96948 6.186136
H  -5.311736 -2.631821 6.498839
elementType: F O N C H
totalener: -2033.59076595 hartree
nucrepener: 4100.43688463 hartree
electener: -6134.02765058 hartree
twoeener: 4813.05611100 hartree
cpcmener: -0.03688279 hartree
kineticenergy: 2025.75786940 hartree
xcener: -182.490205411300 hartree
chargesum: 0.0000000
charge: -0.165473 -0.163653 -0.163365 -0.163148 -0.163861 -0.165554 -0.284824 -0.435590 -0.281056 -0.429657 -0.326083 -0.087798 0.088643 -0.011359 -0.052598 -0.249974 -0.271615 -0.119897 0.368212 -0.304588 0.420138 0.490404 0.025825 -0.229475 -0.225705 0.046075 -0.214719 0.282527 -0.106279 0.478723 0.478587 -0.242708 0.299763 -0.204300 -0.259458 -0.135101 -0.114444 -0.188025 0.126634 0.105616 0.095189 0.090722 0.097925 0.107573 0.098293 0.098388 0.157894 0.140148 0.143984 0.143916 0.145893 0.144792 0.159070 0.147920 0.155716 0.145651 0.159662 0.158290 0.158136
qa: -0.1655 -0.1637 -0.1634 -0.1631 -0.1639 -0.1656 -0.2848 -0.4356 -0.2811 -0.4297 -0.3261 -0.0878 0.0886 -0.0114 -0.0526 -0.2500 -0.2716 -0.1199 0.3682 -0.3046 0.4201 0.4904 0.0258 -0.2295 -0.2257 0.0461 -0.2147 0.2825 -0.1063 0.4787 0.4786 -0.2427 0.2998 -0.2043 -0.2595 -0.1351 -0.1144 -0.1880 0.1266 0.1056 0.0952 0.0907 0.0979 0.1076 0.0983 0.0984 0.1579 0.1401 0.1440 0.1439 0.1459 0.1448 0.1591 0.1479 0.1557 0.1457 0.1597 0.1583 0.1581
va: 1.1468 1.1516 1.1508 1.1509 1.1511 1.1466 2.1244 2.0612 2.1117 2.0757 2.0850 3.1109 3.7736 3.7502 3.8585 3.9077 3.9050 3.8347 4.1509 3.9707 3.7241 4.1036 3.6114 4.0766 3.9288 3.8648 3.9915 3.7281 3.8974 4.5089 4.5081 4.0090 3.6710 3.9220 4.0106 3.8845 3.8763 3.9117 1.0307 1.0275 1.0033 1.0061 1.0017 0.9998 1.0140 1.0012 1.0031 1.0115 1.0162 1.0188 1.0486 1.0027 0.9890 1.0057 0.9980 1.0087 0.9899 0.9889 0.9906
dispcorr: -0.030253414 hartree
energy: -2033.621019368763
dipole: -64.11532 64.13395 0.01863 -55.47528 53.93395 -1.54133 34.76104 -34.14968 0.61137
magnitude: 1.65826 au
magnitude: 4.21496 debye
