program: Orca
programVersion: 5.0.2
elementType: F F F F F F O O O O O N C C C C C C C C C C C C C C C C C C C C C C C C C C H H H H H H H H H H H H H H H H H H H H H
charge: 0
multiplicity: 1
keywords: wb97x-d3
keywords: def2-TZVPP
keywords: def2/J RIJCOSX
keywords: DEFGRID2
keywords: scfconv7
keywords: smallprint printgap noloewdin
keywords: NOSOSCF
formula: C26H21F6NO5
InChI: InChI=1/C26H21F6NO5/c1-24(2)18(11-12-20(34)38-23(25(27,28)29)26(30,31)32)21(24)22(35)37-19(14-33)15-7-6-10-17(13-15)36-16-8-4-3-5-9-16/h3-13,18-19,21,23H,1-2H3
59 atoms
F  3.175704 -0.418715 -2.843683
F  1.633303 1.042567 -3.168516
F  3.664076 1.473278 -3.744604
F  4.598167 1.895235 0.339024
F  4.830647 0.019702 -0.682127
F  5.472128 1.844526 -1.628192
O  -2.680683 0.762771 -0.166764
O  -3.260182 2.419502 -1.554468
O  2.258622 0.878932 -0.538108
O  0.900324 2.666552 -0.489221
O  -0.43456 -3.921555 0.956485
N  -5.290267 -1.295311 -0.493402
C  -2.564458 2.878566 2.015179
C  -1.192458 2.573579 1.516301
C  -2.279487 2.971574 0.524307
C  -2.751279 4.213102 2.698453
C  -3.458359 1.803872 2.583634
C  -0.614216 1.215265 1.564146
C  -2.798592 2.054332 -0.503856
C  0.460131 0.773923 0.901697
C  -2.981225 -0.244997 -1.124186
C  1.178025 1.567767 -0.088592
C  -1.850011 -1.239662 -1.1012
C  -4.271451 -0.839596 -0.764838
C  -1.726926 -2.146633 -0.054988
C  3.133618 1.507699 -1.43739
C  -0.880959 -1.161341 -2.090783
C  -0.614388 -2.975625 -0.005709
C  0.218425 -2.005838 -2.034509
C  2.910956 0.886798 -2.817696
C  4.533066 1.305599 -0.85475
C  0.360797 -2.906947 -0.994306
C  -0.95742 -3.748901 2.211655
C  -0.735105 -2.585804 2.937506
C  -1.663585 -4.806769 2.762825
C  -1.243304 -2.483518 4.22382
C  -2.153951 -4.696879 4.0568
C  -1.953235 -3.535249 4.788588
H  -0.457172 3.361688 1.645295
H  -2.197697 3.979589 0.135611
H  -2.512929 4.13213 3.760689
H  -3.783982 4.555494 2.613218
H  -2.107632 4.983954 2.272793
H  -3.311742 1.744721 3.663739
H  -3.289763 0.808451 2.181406
H  -4.506287 2.054013 2.410496
H  -1.07282 0.511779 2.251205
H  0.819469 -0.231876 1.077204
H  -3.085251 0.180963 -2.125895
H  -2.493092 -2.206588 0.709711
H  2.949252 2.585581 -1.518591
H  -0.985955 -0.450066 -2.899955
H  0.970529 -1.966146 -2.809479
H  1.219962 -3.56429 -0.947669
H  -0.164926 -1.769832 2.510954
H  -1.820979 -5.709595 2.186098
H  -1.074068 -1.57636 4.789616
H  -2.701364 -5.524599 4.488755
H  -2.34352 -3.450446 5.794151
elementType: F O N C H
totalener: -2033.58483216 hartree
nucrepener: 4553.86400611 hartree
electener: -6587.44883827 hartree
twoeener: 5265.59086600 hartree
cpcmener: -0.04054155 hartree
kineticenergy: 2025.78016522 hartree
xcener: -182.493752580005 hartree
chargesum: 0.0000000
charge: -0.167309 -0.167503 -0.162227 -0.166001 -0.162657 -0.162765 -0.252474 -0.439017 -0.274940 -0.428568 -0.324819 -0.082917 0.123720 -0.040831 -0.137570 -0.263058 -0.277809 -0.014250 0.421150 -0.318075 0.359650 0.497471 0.055942 -0.229393 -0.224047 0.033078 -0.216590 0.278409 -0.114671 0.492893 0.479721 -0.231204 0.224539 -0.166274 -0.209835 -0.181012 -0.139916 -0.155787 0.111334 0.097744 0.095696 0.099325 0.089994 0.102248 0.079937 0.108074 0.150871 0.133584 0.132185 0.139587 0.148768 0.142700 0.155224 0.145637 0.194491 0.145929 0.155357 0.158064 0.158199
qa: -0.1673 -0.1675 -0.1622 -0.1660 -0.1627 -0.1628 -0.2525 -0.4390 -0.2749 -0.4286 -0.3248 -0.0829 0.1237 -0.0408 -0.1376 -0.2631 -0.2778 -0.0143 0.4211 -0.3181 0.3596 0.4975 0.0559 -0.2294 -0.2240 0.0331 -0.2166 0.2784 -0.1147 0.4929 0.4797 -0.2312 0.2245 -0.1663 -0.2098 -0.1810 -0.1399 -0.1558 0.1113 0.0977 0.0957 0.0993 0.0900 0.1022 0.0799 0.1081 0.1509 0.1336 0.1322 0.1396 0.1488 0.1427 0.1552 0.1456 0.1945 0.1459 0.1554 0.1581 0.1582
va: 1.1447 1.1415 1.1559 1.1462 1.1509 1.1533 2.1124 2.0738 2.1104 2.0787 2.0895 3.1083 3.7650 3.8068 3.8991 3.9023 3.9063 3.7925 4.1423 3.8866 3.7684 4.1082 3.6476 4.0677 3.9399 3.9048 3.9007 3.7509 3.8356 4.4550 4.5178 4.0109 3.7591 3.8765 3.9897 3.9321 3.8939 3.8862 1.0194 1.0264 1.0021 1.0015 1.0051 1.0002 1.0120 1.0008 0.9760 1.0166 1.0363 1.0114 1.0428 1.0078 1.0029 1.0076 0.9569 1.0067 0.9951 0.9893 0.9902
dispcorr: -0.038096732 hartree
energy: -2033.622928891960
dipole: -51.68946 52.71902 1.02957 -3.11707 3.55189 0.43482 41.00484 -39.01418 1.99066
magnitude: 2.28294 au
magnitude: 5.80277 debye
