program: Orca
programVersion: 5.0.2
elementType: F F F F F F O O O O O N C C C C C C C C C C C C C C C C C C C C C C C C C C H H H H H H H H H H H H H H H H H H H H H
charge: 0
multiplicity: 1
keywords: wb97x-d3
keywords: def2-TZVPP
keywords: def2/J RIJCOSX
keywords: DEFGRID2
keywords: scfconv7
keywords: smallprint printgap noloewdin
keywords: NOSOSCF
formula: C26H21F6NO5
InChI: InChI=1/C26H21F6NO5/c1-24(2)18(11-12-20(34)38-23(25(27,28)29)26(30,31)32)21(24)22(35)37-19(14-33)15-7-6-10-17(13-15)36-16-8-4-3-5-9-16/h3-13,18-19,21,23H,1-2H3
59 atoms
F  2.583199 -1.417757 -1.964698
F  1.125928 0.043949 -2.56127
F  3.14527 0.166141 -3.308434
F  4.305572 -0.667988 0.024778
F  5.105854 0.756371 -1.374546
F  4.347139 1.416902 0.532467
O  -2.979804 0.940086 0.051016
O  -3.20765 2.043627 -1.87601
O  1.8459 0.571905 -0.025299
O  0.750859 2.464297 -0.533309
O  0.599178 -2.877125 0.09092
N  -4.824422 -1.448276 1.375854
C  -2.827702 3.670238 1.387624
C  -1.440593 3.165433 1.188474
C  -2.389505 3.223165 -0.00101
C  -2.990352 5.164847 1.536588
C  -3.83967 2.892762 2.191795
C  -0.956994 1.896688 1.770926
C  -2.896447 2.037949 -0.712154
C  0.102286 1.183569 1.373314
C  -3.508802 -0.24232 -0.534075
C  0.887674 1.512811 0.188105
C  -2.424853 -1.150028 -1.061167
C  -4.248845 -0.906483 0.542778
C  -1.403678 -1.552022 -0.20536
C  2.761998 0.79168 -1.065447
C  -2.474844 -1.599125 -2.370088
C  -0.440589 -2.435609 -0.666229
C  -1.496363 -2.477316 -2.821328
C  2.407044 -0.12642 -2.237978
C  4.150071 0.560229 -0.468508
C  -0.487962 -2.903741 -1.977148
C  0.565211 -2.800371 1.459467
C  1.673758 -2.258791 2.092007
C  -0.501447 -3.297585 2.198013
C  1.709226 -2.200659 3.478073
C  -0.459059 -3.22026 3.582496
C  0.640279 -2.66927 4.227938
H  -0.668269 3.925606 1.121055
H  -2.191656 4.028838 -0.69774
H  -2.8658 5.458499 2.580702
H  -3.984176 5.483615 1.217527
H  -2.257479 5.717369 0.947363
H  -3.799867 3.221116 3.232036
H  -3.694862 1.81596 2.190543
H  -4.848565 3.0902 1.826135
H  -1.482024 1.526206 2.644955
H  0.383165 0.295413 1.92433
H  -4.222666 -0.007488 -1.328663
H  -1.379769 -1.187943 0.813436
H  2.725413 1.823535 -1.434603
H  -3.270945 -1.278231 -3.029635
H  -1.526115 -2.840402 -3.840091
H  0.265804 -3.597474 -2.327541
H  2.503449 -1.891501 1.504232
H  -1.359705 -3.737393 1.705436
H  2.575956 -1.777384 3.96904
H  -1.29309 -3.599098 4.158883
H  0.665694 -2.612755 5.30816
elementType: F O N C H
totalener: -2033.58541047 hartree
nucrepener: 4711.63764263 hartree
electener: -6745.22305310 hartree
twoeener: 5424.91801952 hartree
cpcmener: -0.03842811 hartree
kineticenergy: 2025.77488526 hartree
xcener: -182.494969733788 hartree
chargesum: 0.0000000
charge: -0.166341 -0.166614 -0.163523 -0.161639 -0.162073 -0.165921 -0.271124 -0.440520 -0.276164 -0.429337 -0.317993 -0.087374 0.124267 -0.041734 -0.123269 -0.262497 -0.280469 -0.048168 0.408061 -0.302948 0.380605 0.506341 0.074146 -0.227829 -0.302518 0.021597 -0.212811 0.348942 -0.088362 0.499813 0.485851 -0.290536 0.279258 -0.244574 -0.193327 -0.133451 -0.142599 -0.172415 0.111009 0.098114 0.095764 0.097787 0.089335 0.102105 0.082125 0.106481 0.157131 0.146726 0.137672 0.143211 0.153392 0.145905 0.157322 0.144335 0.150315 0.154697 0.155099 0.160472 0.158248
qa: -0.1663 -0.1666 -0.1635 -0.1616 -0.1621 -0.1659 -0.2711 -0.4405 -0.2762 -0.4293 -0.3180 -0.0874 0.1243 -0.0417 -0.1233 -0.2625 -0.2805 -0.0482 0.4081 -0.3029 0.3806 0.5063 0.0741 -0.2278 -0.3025 0.0216 -0.2128 0.3489 -0.0884 0.4998 0.4859 -0.2905 0.2793 -0.2446 -0.1933 -0.1335 -0.1426 -0.1724 0.1110 0.0981 0.0958 0.0978 0.0893 0.1021 0.0821 0.1065 0.1571 0.1467 0.1377 0.1432 0.1534 0.1459 0.1573 0.1443 0.1503 0.1547 0.1551 0.1605 0.1582
va: 1.1419 1.1449 1.1536 1.1395 1.1548 1.1463 2.1168 2.0702 2.1133 2.0798 2.0756 3.1035 3.7457 3.7914 3.8787 3.9052 3.9124 3.8328 4.1588 3.8866 3.7669 4.0684 3.6339 4.0701 3.9632 3.9029 3.9812 3.5967 3.8735 4.4523 4.4971 4.0025 3.6562 3.9446 3.9038 3.8871 3.8843 3.9062 1.0211 1.0266 1.0021 1.0017 1.0052 0.9999 1.0084 1.0003 0.9831 1.0105 1.0250 1.0074 1.0454 1.0029 0.9889 1.0094 1.0180 0.9990 0.9916 0.9893 0.9901
dispcorr: -0.040084248 hartree
energy: -2033.625494719748
dipole: -47.24904 47.22947 -0.01957 12.63962 -11.49483 1.14479 29.13245 -27.91058 1.22187
magnitude: 1.67448 au
magnitude: 4.25620 debye
