program: Orca
programVersion: 5.0.2
elementType: F F F F F F O O O O O N C C C C C C C C C C C C C C C C C C C C C C C C C C H H H H H H H H H H H H H H H H H H H H H
charge: 0
multiplicity: 1
keywords: wb97x-d3
keywords: def2-TZVPP
keywords: def2/J RIJCOSX
keywords: DEFGRID2
keywords: scfconv7
keywords: smallprint printgap noloewdin
keywords: NOSOSCF
formula: C26H21F6NO5
InChI: InChI=1/C26H21F6NO5/c1-24(2)18(11-12-20(34)38-23(25(27,28)29)26(30,31)32)21(24)22(35)37-19(14-33)15-7-6-10-17(13-15)36-16-8-4-3-5-9-16/h3-13,18-19,21,23H,1-2H3
59 atoms
F  3.420765 5.584427 -0.563753
F  5.507859 6.073203 -0.756827
F  4.325555 5.664389 -2.510664
F  6.038491 3.576897 -3.158671
F  7.212155 4.030426 -1.413967
F  6.324103 2.082622 -1.641043
O  -2.659136 -0.329357 0.555244
O  -1.639924 -0.52583 -1.419104
O  3.803739 3.105666 -1.662248
O  3.295107 2.148143 0.30337
O  -4.299337 -5.21231 1.19688
N  -5.698213 0.434218 1.580316
C  0.804648 -1.280385 0.407557
C  0.994897 0.187585 0.115503
C  -0.354293 -0.333584 0.611334
C  1.446168 -1.795518 1.673292
C  0.797095 -2.300876 -0.703066
C  1.190998 0.675386 -1.248774
C  -1.565659 -0.401314 -0.224274
C  2.086232 1.573204 -1.6880
C  -3.914694 -0.484443 -0.092949
C  3.083767 2.26319 -0.874793
C  -4.218156 -1.92771 -0.421162
C  -4.900662 0.035252 0.857109
C  -4.104061 -2.888686 0.577176
C  4.868587 3.826587 -1.099788
C  -4.614325 -2.277668 -1.70251
C  -4.413492 -4.208523 0.283327
C  -4.908564 -3.60476 -1.983845
C  4.532719 5.309323 -1.243874
C  6.130321 3.385148 -1.844158
C  -4.81597 -4.571304 -0.997268
C  -4.5357 -4.977033 2.525986
C  -3.65795 -5.547549 3.43599
C  -5.6401 -4.254264 2.960977
C  -3.888719 -5.392652 4.795772
C  -5.850335 -4.096756 4.322942
C  -4.979113 -4.661582 5.245259
H  1.524014 0.729733 0.886211
H  -0.560287 -0.078404 1.643918
H  2.486272 -2.070686 1.490184
H  0.923804 -2.683986 2.032949
H  1.432445 -1.053148 2.471786
H  0.396934 -1.944435 -1.647089
H  0.212128 -3.171882 -0.405506
H  1.816481 -2.640003 -0.888961
H  0.550758 0.260718 -2.016167
H  2.092576 1.808747 -2.744214
H  -3.9742 0.129437 -0.997198
H  -3.78259 -2.606889 1.573245
H  5.007136 3.610783 -0.033753
H  -4.693415 -1.523363 -2.475011
H  -5.217918 -3.889061 -2.980856
H  -5.052108 -5.60563 -1.213667
H  -2.805692 -6.113533 3.081018
H  -6.333475 -3.81855 2.252168
H  -3.205375 -5.84234 5.504546
H  -6.708375 -3.531093 4.662462
H  -5.15241 -4.535972 6.30593
elementType: F O N C H
totalener: -2033.59111289 hartree
nucrepener: 4057.64710188 hartree
electener: -6091.23821477 hartree
twoeener: 4770.36173131 hartree
cpcmener: -0.03690718 hartree
kineticenergy: 2025.75952919 hartree
xcener: -182.489537837482 hartree
chargesum: -0.0000000
charge: -0.164994 -0.163682 -0.163463 -0.163401 -0.163393 -0.165715 -0.286873 -0.441474 -0.279236 -0.429309 -0.326714 -0.087285 0.094442 -0.011274 -0.063609 -0.253349 -0.273129 -0.120386 0.384280 -0.303775 0.423338 0.489628 0.021813 -0.230339 -0.209244 0.046103 -0.207356 0.256402 -0.110236 0.477087 0.477685 -0.234112 0.285208 -0.248813 -0.196462 -0.121454 -0.138196 -0.184352 0.123205 0.104450 0.097986 0.096621 0.090645 0.097476 0.104408 0.103006 0.160922 0.140177 0.141913 0.145597 0.147199 0.146010 0.158443 0.148101 0.146844 0.156282 0.158386 0.160124 0.157846
qa: -0.1650 -0.1637 -0.1635 -0.1634 -0.1634 -0.1657 -0.2869 -0.4415 -0.2792 -0.4293 -0.3267 -0.0873 0.0944 -0.0113 -0.0636 -0.2533 -0.2731 -0.1204 0.3843 -0.3038 0.4233 0.4896 0.0218 -0.2303 -0.2092 0.0461 -0.2074 0.2564 -0.1102 0.4771 0.4777 -0.2341 0.2852 -0.2488 -0.1965 -0.1215 -0.1382 -0.1844 0.1232 0.1045 0.0980 0.0966 0.0906 0.0975 0.1044 0.1030 0.1609 0.1402 0.1419 0.1456 0.1472 0.1460 0.1584 0.1481 0.1468 0.1563 0.1584 0.1601 0.1578
va: 1.1479 1.1514 1.1509 1.1504 1.1520 1.1466 2.1311 2.0576 2.1114 2.0756 2.0846 3.1113 3.7656 3.7548 3.8798 3.9097 3.9094 3.8288 4.1293 3.9692 3.7238 4.1062 3.5961 4.0784 3.9366 3.8712 3.9750 3.7601 3.9026 4.5097 4.5099 4.0066 3.6891 4.0131 3.9166 3.8821 3.8877 3.9081 1.0312 1.0276 1.0018 1.0020 1.0058 1.0130 0.9991 1.0009 1.0017 1.0115 1.0174 1.0171 1.0465 1.0036 0.9894 1.0053 1.0076 0.9973 0.9890 0.9898 0.9906
dispcorr: -0.029491993 hartree
energy: -2033.620604886311
dipole: -59.67421 59.74842 0.07421 -67.05898 65.29649 -1.76249 24.88926 -24.97853 -0.08927
magnitude: 1.76631 au
magnitude: 4.48961 debye
