program: Orca
programVersion: 5.0.2
elementType: F F F F F F O O O O O N C C C C C C C C C C C C C C C C C C C C C C C C C C H H H H H H H H H H H H H H H H H H H H H
charge: 0
multiplicity: 1
keywords: wb97x-d3
keywords: def2-TZVPP
keywords: def2/J RIJCOSX
keywords: DEFGRID2
keywords: scfconv7
keywords: smallprint printgap noloewdin
keywords: NOSOSCF
formula: C26H21F6NO5
InChI: InChI=1/C26H21F6NO5/c1-24(2)18(11-12-20(34)38-23(25(27,28)29)26(30,31)32)21(24)22(35)37-19(14-33)15-7-6-10-17(13-15)36-16-8-4-3-5-9-16/h3-13,18-19,21,23H,1-2H3
59 atoms
F  3.51454 5.183681 0.601665
F  5.523626 5.89457 0.286968
F  4.045196 6.110565 -1.263183
F  5.57813 4.510704 -3.009309
F  7.074494 4.389164 -1.463478
F  6.162342 2.595821 -2.233094
O  -2.463514 -0.516993 0.761814
O  -1.807753 -0.291451 -1.359318
O  3.680894 3.39703 -1.417724
O  3.561666 1.729251 0.076754
O  -4.392633 -5.339682 0.657012
N  -5.220758 0.110757 2.461675
C  0.918142 -1.371038 -0.278741
C  1.053442 0.122476 -0.134993
C  -0.187025 -0.594355 0.397298
C  1.777524 -2.20358 0.641002
C  0.722148 -2.004776 -1.633911
C  1.010121 1.007726 -1.298147
C  -1.525013 -0.445479 -0.198978
C  1.890235 1.964268 -1.627425
C  -3.819199 -0.471521 0.334763
C  3.095812 2.298739 -0.874418
C  -4.277342 -1.791577 -0.238398
C  -4.58715 -0.138443 1.536741
C  -4.118605 -2.94881 0.515594
C  4.84586 3.909387 -0.824762
C  -4.835873 -1.84107 -1.506357
C  -4.545306 -4.16041 -0.007661
C  -5.246586 -3.063148 -2.020736
C  4.488501 5.301733 -0.302564
C  5.930966 3.866199 -1.899256
C  -5.108704 -4.222642 -1.277068
C  -4.514449 -5.391063 2.020809
C  -3.604144 -6.180385 2.707965
C  -5.54103 -4.73928 2.693768
C  -3.723186 -6.318183 4.083799
C  -5.639052 -4.875521 4.070689
C  -4.734925 -5.662949 4.771383
H  1.7115 0.435114 0.662955
H  -0.205949 -0.669679 1.477872
H  2.767971 -2.349761 0.206286
H  1.333206 -3.187967 0.799136
H  1.907832 -1.733862 1.616522
H  0.188269 -1.388001 -2.350788
H  0.175831 -2.944134 -1.533076
H  1.696797 -2.23692 -2.066048
H  0.179708 0.890318 -1.982394
H  1.70608 2.547286 -2.520374
H  -3.981709 0.333217 -0.389249
H  -3.66941 -2.902995 1.501222
H  5.186553 3.306359 0.025202
H  -4.949985 -0.935699 -2.088375
H  -5.681561 -3.112755 -3.010033
H  -5.433169 -5.175702 -1.675355
H  -2.813544 -6.686644 2.168448
H  -6.261057 -4.133661 2.157462
H  -3.014537 -6.937493 4.618384
H  -6.436223 -4.365713 4.596075
H  -4.821122 -5.76708 5.844934
elementType: F O N C H
totalener: -2033.59103493 hartree
nucrepener: 4052.14975248 hartree
electener: -6085.74078742 hartree
twoeener: 4764.94659843 hartree
cpcmener: -0.03678600 hartree
kineticenergy: 2025.76339833 hartree
xcener: -182.489993239559 hartree
chargesum: 0.0000000
charge: -0.166011 -0.162840 -0.163476 -0.163329 -0.163394 -0.165969 -0.286922 -0.445206 -0.281225 -0.428190 -0.327280 -0.088082 0.101043 -0.008387 -0.079559 -0.254123 -0.274885 -0.123419 0.392049 -0.294199 0.425794 0.488085 0.019021 -0.229413 -0.202814 0.044580 -0.200773 0.244308 -0.112486 0.479384 0.477151 -0.231420 0.280532 -0.248787 -0.190472 -0.120408 -0.140254 -0.183742 0.118304 0.105435 0.097565 0.097154 0.090643 0.098170 0.105660 0.101589 0.162205 0.140854 0.140712 0.146751 0.150248 0.145572 0.158985 0.148333 0.146401 0.155160 0.157971 0.159431 0.157972
qa: -0.1660 -0.1628 -0.1635 -0.1633 -0.1634 -0.1660 -0.2869 -0.4452 -0.2812 -0.4282 -0.3273 -0.0881 0.1010 -0.0084 -0.0796 -0.2541 -0.2749 -0.1234 0.3920 -0.2942 0.4258 0.4881 0.0190 -0.2294 -0.2028 0.0446 -0.2008 0.2443 -0.1125 0.4794 0.4772 -0.2314 0.2805 -0.2488 -0.1905 -0.1204 -0.1403 -0.1837 0.1183 0.1054 0.0976 0.0972 0.0906 0.0982 0.1057 0.1016 0.1622 0.1409 0.1407 0.1468 0.1502 0.1456 0.1590 0.1483 0.1464 0.1552 0.1580 0.1594 0.1580
va: 1.1457 1.1531 1.1505 1.1505 1.1525 1.1460 2.1355 2.0541 2.1106 2.0754 2.0827 3.1101 3.7663 3.7612 3.9099 3.9105 3.9103 3.8425 4.1099 3.9603 3.7266 4.1118 3.5929 4.0772 3.9437 3.8599 3.9653 3.7704 3.9024 4.5080 4.5152 4.0088 3.6944 4.0118 3.9116 3.8832 3.8899 3.9068 1.0311 1.0270 1.0023 1.0019 1.0056 1.0128 0.9988 1.0011 1.0013 1.0110 1.0166 1.0154 1.0462 1.0048 0.9892 1.0049 1.0080 0.9977 0.9891 0.9902 0.9906
dispcorr: -0.029436837 hartree
energy: -2033.620471770312
dipole: -58.02689 57.96919 -0.05771 -70.77628 69.22534 -1.55094 14.02354 -14.63030 -0.60676
magnitude: 1.66641 au
magnitude: 4.23568 debye
