program: Orca
programVersion: 5.0.2
elementType: F F F F F F O O O O O N C C C C C C C C C C C C C C C C C C C C C C C C C C H H H H H H H H H H H H H H H H H H H H H
charge: 0
multiplicity: 1
keywords: wb97x-d3
keywords: def2-TZVPP
keywords: def2/J RIJCOSX
keywords: DEFGRID2
keywords: scfconv7
keywords: smallprint printgap noloewdin
keywords: NOSOSCF
formula: C26H21F6NO5
InChI: InChI=1/C26H21F6NO5/c1-24(2)18(11-12-20(34)38-23(25(27,28)29)26(30,31)32)21(24)22(35)37-19(14-33)15-7-6-10-17(13-15)36-16-8-4-3-5-9-16/h3-13,18-19,21,23H,1-2H3
59 atoms
F  3.216601 4.767661 -2.906268
F  5.17311 5.662705 -2.781805
F  4.873063 3.868091 -3.935169
F  6.679884 2.449818 -2.308577
F  7.041983 4.304744 -1.277217
F  6.329471 2.582752 -0.19472
O  -3.036622 0.041703 -0.595894
O  -1.257851 -1.223488 -1.055655
O  4.051419 2.476143 -1.692019
O  2.572455 3.08742 -0.119543
O  -4.833313 -3.278432 2.718204
N  -6.06578 0.464753 -1.811272
C  -0.123113 0.210232 1.505749
C  0.417439 1.014546 0.349291
C  -1.070008 0.670962 0.424572
C  -0.247964 0.939222 2.821668
C  0.222662 -1.248405 1.676126
C  1.302994 0.418582 -0.648545
C  -1.735228 -0.279009 -0.482811
C  2.404131 0.949696 -1.20035
C  -3.845996 -0.836703 -1.360228
C  2.960255 2.268182 -0.909278
C  -4.144986 -2.13479 -0.64351
C  -5.085799 -0.094877 -1.600992
C  -4.329212 -2.142784 0.732914
C  4.777131 3.669403 -1.559287
C  -4.24908 -3.308237 -1.375578
C  -4.620703 -3.337942 1.372692
C  -4.557158 -4.493235 -0.722798
C  4.520063 4.501803 -2.818035
C  6.231739 3.250722 -1.344611
C  -4.746114 -4.51902 0.64939
C  -4.384467 -4.283065 3.533195
C  -3.134478 -4.867306 3.366127
C  -5.208587 -4.659341 4.584117
C  -2.720288 -5.844572 4.259539
C  -4.775371 -5.629497 5.476509
C  -3.535104 -6.231217 5.315254
H  0.601007 2.054748 0.576575
H  -1.69376 1.515691 0.69164
H  0.691908 0.892353 3.374295
H  -1.022424 0.482644 3.440967
H  -0.504938 1.990349 2.68672
H  1.128269 -1.33588 2.278723
H  0.396229 -1.788682 0.749735
H  -0.578319 -1.761813 2.212072
H  1.060319 -0.579301 -0.988855
H  2.946241 0.356991 -1.925474
H  -3.39513 -1.04441 -2.336716
H  -4.250266 -1.234329 1.317962
H  4.463213 4.264501 -0.692869
H  -4.093796 -3.299429 -2.447041
H  -4.649263 -5.410888 -1.288602
H  -4.989952 -5.45049 1.144417
H  -2.483445 -4.565346 2.554826
H  -6.178338 -4.192288 4.703583
H  -1.747768 -6.301749 4.128961
H  -5.418946 -5.920708 6.296665
H  -3.203767 -6.992745 6.00884
elementType: F O N C H
totalener: -2033.59071064 hartree
nucrepener: 4051.06089461 hartree
electener: -6084.65160525 hartree
twoeener: 4763.52488247 hartree
cpcmener: -0.03805594 hartree
kineticenergy: 2025.75088346 hartree
xcener: -182.488060788538 hartree
chargesum: 0.0000000
charge: -0.164921 -0.163848 -0.163614 -0.163113 -0.163323 -0.166221 -0.285361 -0.437919 -0.278991 -0.428708 -0.326983 -0.085509 0.091104 -0.016828 -0.045704 -0.253299 -0.269865 -0.117799 0.370122 -0.303164 0.412613 0.488995 0.016511 -0.230675 -0.223568 0.047204 -0.200834 0.231419 -0.127891 0.476783 0.476737 -0.170529 0.274937 -0.181651 -0.240026 -0.153769 -0.125287 -0.179237 0.123684 0.104488 0.098017 0.097226 0.090676 0.103721 0.097260 0.101312 0.158313 0.139148 0.144567 0.135150 0.148132 0.145192 0.160498 0.159098 0.155517 0.145783 0.159139 0.157470 0.157820
qa: -0.1649 -0.1638 -0.1636 -0.1631 -0.1633 -0.1662 -0.2854 -0.4379 -0.2790 -0.4287 -0.3270 -0.0855 0.0911 -0.0168 -0.0457 -0.2533 -0.2699 -0.1178 0.3701 -0.3032 0.4126 0.4890 0.0165 -0.2307 -0.2236 0.0472 -0.2008 0.2314 -0.1279 0.4768 0.4767 -0.1705 0.2749 -0.1817 -0.2400 -0.1538 -0.1253 -0.1792 0.1237 0.1045 0.0980 0.0972 0.0907 0.1037 0.0973 0.1013 0.1583 0.1391 0.1446 0.1352 0.1481 0.1452 0.1605 0.1591 0.1555 0.1458 0.1591 0.1575 0.1578
va: 1.1471 1.1516 1.1505 1.1506 1.1521 1.1458 2.1218 2.0579 2.1110 2.0755 2.0751 3.1135 3.7684 3.7712 3.8572 3.9101 3.9103 3.8344 4.1311 3.9742 3.7162 4.1071 3.6386 4.0740 4.0310 3.8693 3.9931 3.7976 3.8993 4.5041 4.5167 3.9129 3.6935 3.8907 4.0009 3.8995 3.8898 3.8990 1.0308 1.0280 1.0020 1.0018 1.0058 1.0014 1.0129 0.9986 1.0026 1.0120 1.0163 1.0283 1.0437 1.0023 0.9904 0.9940 0.9978 1.0078 0.9904 0.9893 0.9903
dispcorr: -0.029555890 hartree
energy: -2033.620266532591
dipole: -61.77543 62.23744 0.46200 -57.88390 55.72348 -2.16042 42.93219 -41.51201 1.42018
magnitude: 2.62636 au
magnitude: 6.67568 debye
