program: Orca
programVersion: 5.0.2
elementType: F F F F F F O O O O O N C C C C C C C C C C C C C C C C C C C C C C C C C C H H H H H H H H H H H H H H H H H H H H H
charge: 0
multiplicity: 1
keywords: wb97x-d3
keywords: def2-TZVPP
keywords: def2/J RIJCOSX
keywords: DEFGRID2
keywords: scfconv7
keywords: smallprint printgap noloewdin
keywords: NOSOSCF
formula: C26H21F6NO5
InChI: InChI=1/C26H21F6NO5/c1-24(2)18(11-12-20(34)38-23(25(27,28)29)26(30,31)32)21(24)22(35)37-19(14-33)15-7-6-10-17(13-15)36-16-8-4-3-5-9-16/h3-13,18-19,21,23H,1-2H3
59 atoms
F  4.25013 3.81866 -3.809938
F  6.001527 4.911254 -3.196733
F  5.987364 2.757678 -3.133903
F  6.66112 3.08233 -0.472345
F  6.350464 5.214101 -0.46248
F  5.141613 3.939759 0.782785
O  -3.277866 0.171833 -0.886758
O  -1.397952 -0.926396 -0.403636
O  3.995467 2.69648 -1.310892
O  2.148287 3.756053 -0.601531
O  -3.904914 -5.396696 0.865293
N  -6.030704 -0.428186 -2.605761
C  -0.908847 1.647654 1.352231
C  -0.117137 1.882042 0.088716
C  -1.577203 1.441671 0.013418
C  -1.336342 2.882142 2.108089
C  -0.597403 0.482258 2.257802
C  0.991932 1.007359 -0.291048
C  -2.013949 0.107713 -0.432931
C  2.219715 1.360043 -0.702145
C  -3.872032 -1.059407 -1.275844
C  2.716989 2.72562 -0.847786
C  -4.234787 -1.926615 -0.092296
C  -5.076726 -0.684717 -2.01995
C  -3.881867 -3.266283 -0.104065
C  4.676765 3.907142 -1.510225
C  -4.912362 -1.383811 0.993346
C  -4.227237 -4.077054 0.969157
C  -5.2394 -2.202689 2.062392
C  5.248477 3.845794 -2.928215
C  5.732214 4.035654 -0.408514
C  -4.907443 -3.549878 2.05945
C  -3.567847 -6.112331 1.984944
C  -2.637537 -5.636724 2.900653
C  -4.142572 -7.364543 2.140857
C  -2.2900 -6.429861 3.984126
C  -3.777306 -8.15172 3.224168
C  -2.8555 -7.687304 4.151389
H  0.001464 2.923946 -0.171979
H  -2.251919 2.234548 -0.286253
H  -1.563631 3.713691 1.440437
H  -0.545418 3.205493 2.78746
H  -2.227359 2.678148 2.704972
H  0.176506 0.77555 2.969773
H  -0.248083 -0.410676 1.746457
H  -1.4856 0.207983 2.830613
H  0.82116 -0.059561 -0.232573
H  2.921517 0.571945 -0.941555
H  -3.222215 -1.610441 -1.96387
H  -3.342304 -3.686969 -0.944008
H  4.014378 4.778236 -1.4471
H  -5.189897 -0.337392 1.009653
H  -5.772061 -1.792384 2.910175
H  -5.186419 -4.17505 2.897961
H  -2.180526 -4.663369 2.770898
H  -4.864385 -7.721664 1.417206
H  -1.563998 -6.062027 4.69782
H  -4.224237 -9.130181 3.343973
H  -2.576072 -8.301714 4.997001
elementType: F O N C H
totalener: -2033.59104772 hartree
nucrepener: 4015.99223333 hartree
electener: -6049.58328105 hartree
twoeener: 4728.55520804 hartree
cpcmener: -0.03768831 hartree
kineticenergy: 2025.73767596 hartree
xcener: -182.485210061935 hartree
chargesum: 0.0000000
charge: -0.165580 -0.163784 -0.162693 -0.163006 -0.163155 -0.165025 -0.279947 -0.442620 -0.279001 -0.429693 -0.326930 -0.087415 0.092911 -0.012071 -0.062569 -0.253611 -0.271327 -0.120385 0.381820 -0.300103 0.410040 0.489152 0.023021 -0.226391 -0.226207 0.050081 -0.221151 0.251277 -0.144002 0.476161 0.476037 -0.164035 0.258009 -0.176521 -0.232654 -0.149386 -0.129020 -0.174578 0.121619 0.105951 0.091287 0.098247 0.096229 0.103803 0.097851 0.102690 0.160918 0.140224 0.139639 0.134770 0.143785 0.148428 0.160214 0.158267 0.159588 0.146085 0.158666 0.157778 0.158309
qa: -0.1656 -0.1638 -0.1627 -0.1630 -0.1632 -0.1650 -0.2799 -0.4426 -0.2790 -0.4297 -0.3269 -0.0874 0.0929 -0.0121 -0.0626 -0.2536 -0.2713 -0.1204 0.3818 -0.3001 0.4100 0.4892 0.0230 -0.2264 -0.2262 0.0501 -0.2212 0.2513 -0.1440 0.4762 0.4760 -0.1640 0.2580 -0.1765 -0.2327 -0.1494 -0.1290 -0.1746 0.1216 0.1060 0.0913 0.0982 0.0962 0.1038 0.0979 0.1027 0.1609 0.1402 0.1396 0.1348 0.1438 0.1484 0.1602 0.1583 0.1596 0.1461 0.1587 0.1578 0.1583
va: 1.1466 1.1512 1.1509 1.1512 1.1515 1.1468 2.1338 2.0564 2.1131 2.0735 2.0741 3.1129 3.7701 3.7546 3.8836 3.9096 3.9101 3.8327 4.1271 3.9699 3.7232 4.1040 3.6133 4.0780 4.0735 3.8727 3.9646 3.7830 3.9212 4.5166 4.5014 3.9025 3.7068 3.9089 4.0029 3.8942 3.8878 3.8966 1.0310 1.0272 1.0059 1.0019 1.0020 1.0006 1.0127 1.0002 1.0026 1.0116 1.0182 1.0183 1.0455 1.0117 0.9907 0.9952 0.9956 1.0072 0.9906 0.9894 0.9901
dispcorr: -0.029185319 hartree
energy: -2033.620233041962
dipole: -68.15795 67.95349 -0.20445 -47.48414 46.84946 -0.63468 40.02065 -37.72064 2.30001
magnitude: 2.39471 au
magnitude: 6.08688 debye
