program: Orca
programVersion: 5.0.2
elementType: F F F F F F O O O O O N C C C C C C C C C C C C C C C C C C C C C C C C C C H H H H H H H H H H H H H H H H H H H H H
charge: 0
multiplicity: 1
keywords: wb97x-d3
keywords: def2-TZVPP
keywords: def2/J RIJCOSX
keywords: DEFGRID2
keywords: scfconv7
keywords: smallprint printgap noloewdin
keywords: NOSOSCF
formula: C26H21F6NO5
InChI: InChI=1/C26H21F6NO5/c1-24(2)18(11-12-20(34)38-23(25(27,28)29)26(30,31)32)21(24)22(35)37-19(14-33)15-7-6-10-17(13-15)36-16-8-4-3-5-9-16/h3-13,18-19,21,23H,1-2H3
59 atoms
F  3.944788 4.267384 -3.528083
F  5.711605 5.391181 -3.018522
F  5.807775 3.25091 -3.195575
F  5.355195 3.998837 0.915679
F  6.662688 3.118243 -0.54393
F  6.521248 5.263491 -0.380013
O  -3.057599 0.021198 -0.915061
O  -1.179476 -1.01405 -0.302901
O  4.019237 2.891769 -1.169764
O  2.122115 3.845546 -0.448146
O  -3.830266 -5.579263 0.72753
N  -5.627007 -0.637768 -2.870636
C  -0.839419 1.575076 1.453962
C  -0.036154 1.85488 0.207911
C  -1.471805 1.344855 0.102131
C  -1.340007 2.78556 2.204325
C  -0.489372 0.423947 2.363609
C  1.117475 1.036706 -0.160296
C  -1.828627 -0.002518 -0.371589
C  2.326313 1.456361 -0.563362
C  -3.584073 -1.223974 -1.350738
C  2.745376 2.848576 -0.699789
C  -4.038032 -2.095716 -0.203048
C  -4.728911 -0.876326 -2.195947
C  -3.700742 -3.438906 -0.201153
C  4.655623 4.134695 -1.308909
C  -4.80092 -1.555674 0.82588
C  -4.151813 -4.260138 0.825041
C  -5.233844 -2.384361 1.847711
C  5.04831 4.262122 -2.780836
C  5.825411 4.130165 -0.326131
C  -4.924236 -3.737138 1.854202
C  -3.723506 -6.351215 1.855714
C  -4.389264 -7.567161 1.866147
C  -2.927951 -5.964832 2.927261
C  -4.253343 -8.407631 2.962881
C  -2.811821 -6.808371 4.021945
C  -3.471409 -8.030747 4.045393
H  0.036592 2.902271 -0.046484
H  -2.175562 2.107568 -0.208689
H  -0.581464 3.139675 2.904661
H  -2.23609 2.540219 2.777366
H  -1.585418 3.610007 1.53438
H  -0.090751 -0.450649 1.858299
H  -1.372379 0.108029 2.921363
H  0.257152 0.751466 3.088773
H  1.003598 -0.03769 -0.098615
H  3.07371 0.709836 -0.798172
H  -2.86388 -1.762473 -1.975538
H  -3.094449 -3.855559 -0.99671
H  3.999588 4.975831 -1.055621
H  -5.065696 -0.505973 0.832184
H  -5.834881 -1.977916 2.650321
H  -5.291727 -4.366516 2.654241
H  -5.002774 -7.855097 1.021656
H  -2.400889 -5.01894 2.910657
H  -4.769592 -9.358847 2.970313
H  -2.194024 -6.508016 4.858417
H  -3.37316 -8.68595 4.900887
elementType: F O N C H
totalener: -2033.59094679 hartree
nucrepener: 4002.98406092 hartree
electener: -6036.57500771 hartree
twoeener: 4715.57475699 hartree
cpcmener: -0.03770434 hartree
kineticenergy: 2025.77188024 hartree
xcener: -182.491700276854 hartree
chargesum: -0.0000000
charge: -0.165243 -0.163621 -0.163320 -0.166680 -0.163153 -0.163212 -0.281145 -0.442696 -0.280411 -0.428348 -0.324233 -0.086946 0.090433 -0.010938 -0.061596 -0.252918 -0.271421 -0.120766 0.382262 -0.298521 0.408468 0.486297 0.027117 -0.226849 -0.236372 0.046691 -0.222434 0.269943 -0.146224 0.477664 0.477417 -0.176090 0.260418 -0.230707 -0.185374 -0.127779 -0.145225 -0.176070 0.121678 0.105227 0.097786 0.096518 0.091099 0.097870 0.103037 0.103015 0.160711 0.140202 0.140699 0.134462 0.149046 0.148419 0.160539 0.157813 0.147080 0.159793 0.157928 0.159835 0.158824
qa: -0.1652 -0.1636 -0.1633 -0.1667 -0.1632 -0.1632 -0.2811 -0.4427 -0.2804 -0.4283 -0.3242 -0.0869 0.0904 -0.0109 -0.0616 -0.2529 -0.2714 -0.1208 0.3823 -0.2985 0.4085 0.4863 0.0271 -0.2268 -0.2364 0.0467 -0.2224 0.2699 -0.1462 0.4777 0.4774 -0.1761 0.2604 -0.2307 -0.1854 -0.1278 -0.1452 -0.1761 0.1217 0.1052 0.0978 0.0965 0.0911 0.0979 0.1030 0.1030 0.1607 0.1402 0.1407 0.1345 0.1490 0.1484 0.1605 0.1578 0.1471 0.1598 0.1579 0.1598 0.1588
va: 1.1471 1.1519 1.1507 1.1454 1.1508 1.1527 2.1318 2.0566 2.1107 2.0761 2.0798 3.1131 3.7681 3.7534 3.8830 3.9099 3.9085 3.8355 4.1243 3.9689 3.7235 4.1107 3.6179 4.0774 4.0797 3.8658 3.9670 3.7723 3.9274 4.5127 4.5092 3.9018 3.7046 4.0076 3.9228 3.8862 3.8897 3.8987 1.0318 1.0276 1.0020 1.0021 1.0060 1.0132 0.9997 1.0007 1.0023 1.0114 1.0186 1.0187 1.0459 1.0120 0.9907 0.9961 1.0067 0.9953 0.9894 0.9901 0.9901
dispcorr: -0.028992164 hartree
energy: -2033.619938959022
dipole: -68.77841 68.44054 -0.33787 -51.19214 50.47223 -0.71991 39.55273 -37.04059 2.51214
magnitude: 2.63501 au
magnitude: 6.69766 debye
