program: Orca
programVersion: 5.0.2
elementType: F F F F F F O O O O O N C C C C C C C C C C C C C C C C C C C C C C C C C C H H H H H H H H H H H H H H H H H H H H H
charge: 0
multiplicity: 1
keywords: wb97x-d3
keywords: def2-TZVPP
keywords: def2/J RIJCOSX
keywords: DEFGRID2
keywords: scfconv7
keywords: smallprint printgap noloewdin
keywords: NOSOSCF
formula: C26H21F6NO5
InChI: InChI=1/C26H21F6NO5/c1-24(2)18(11-12-20(34)38-23(25(27,28)29)26(30,31)32)21(24)22(35)37-19(14-33)15-7-6-10-17(13-15)36-16-8-4-3-5-9-16/h3-13,18-19,21,23H,1-2H3
59 atoms
F  2.716962 0.444864 -1.831739
F  4.036121 1.049637 -3.42737
F  4.827708 0.615601 -1.472181
F  4.420781 4.781521 -1.526532
F  5.852705 3.189226 -1.358392
F  4.998256 3.664076 -3.276561
O  -1.262109 0.395919 -0.857602
O  0.379831 0.227504 0.647439
O  3.32365 2.621485 -0.336049
O  1.189352 3.256779 -0.631132
O  -3.934059 -2.988951 1.710467
N  -2.18626 -1.109167 -3.640398
C  -1.640541 2.110564 2.220696
C  -0.506712 2.950439 1.740919
C  -1.199366 2.038873 0.759341
C  -2.973122 2.777447 2.455729
C  -1.37387 0.953064 3.150547
C  0.870416 2.758022 2.247115
C  -0.574873 0.822723 0.220432
C  2.015095 2.785718 1.560884
C  -0.880305 -0.861919 -1.390736
C  2.07685 2.927001 0.108163
C  -1.229109 -2.014874 -0.476062
C  -1.619048 -0.981426 -2.649735
C  -2.449307 -2.025369 0.1864
C  3.560966 2.62012 -1.719082
C  -0.332091 -3.060607 -0.31862
C  -2.757185 -3.082325 1.031045
C  -0.661733 -4.119177 0.515201
C  3.80341 1.164752 -2.121786
C  4.733993 3.566124 -1.974607
C  -1.866176 -4.136935 1.200644
C  -4.639482 -4.110994 2.056495
C  -5.166546 -4.155493 3.3389
C  -4.885227 -5.135661 1.150641
C  -5.952284 -5.235394 3.716344
C  -5.663035 -6.214497 1.545886
C  -6.199914 -6.270343 2.825569
H  -0.736974 3.998796 1.562899
H  -1.865799 2.530448 0.060578
H  -3.032114 3.167328 3.473937
H  -3.792304 2.067855 2.324244
H  -3.138903 3.609878 1.771042
H  -2.121412 0.168985 3.013894
H  -1.442985 1.292352 4.185898
H  -0.393044 0.498586 3.025799
H  0.957597 2.618478 3.320217
H  2.952251 2.647913 2.084493
H  0.187156 -0.88634 -1.632049
H  -3.162827 -1.218418 0.065177
H  2.702065 2.99141 -2.29126
H  0.619242 -3.046523 -0.835294
H  0.035964 -4.935157 0.650289
H  -2.095366 -4.959387 1.865982
H  -4.968174 -3.347311 4.031786
H  -4.484368 -5.095908 0.145212
H  -6.366908 -5.26687 4.715728
H  -5.856306 -7.012957 0.841105
H  -6.810414 -7.112448 3.123975
elementType: F O N C H
totalener: -2033.58760338 hartree
nucrepener: 4316.50394871 hartree
electener: -6350.09155209 hartree
twoeener: 5030.40357178 hartree
cpcmener: -0.03926505 hartree
kineticenergy: 2025.75412853 hartree
xcener: -182.487447585227 hartree
chargesum: -0.0000000
charge: -0.161235 -0.163440 -0.162661 -0.165040 -0.162960 -0.164049 -0.284207 -0.432858 -0.278966 -0.418620 -0.328759 -0.087800 0.105014 -0.025919 -0.038400 -0.259153 -0.290443 -0.102600 0.323752 -0.255436 0.424209 0.483053 0.037218 -0.231589 -0.283303 0.044598 -0.201350 0.281205 -0.128102 0.479281 0.479117 -0.186176 0.266374 -0.238644 -0.185861 -0.128183 -0.148206 -0.175876 0.116660 0.101422 0.095286 0.097119 0.090002 0.100369 0.106050 0.098389 0.156025 0.142422 0.136593 0.135100 0.147943 0.144450 0.160390 0.158099 0.146458 0.157731 0.157424 0.159323 0.158757
qa: -0.1612 -0.1634 -0.1627 -0.1650 -0.1630 -0.1640 -0.2842 -0.4329 -0.2790 -0.4186 -0.3288 -0.0878 0.1050 -0.0259 -0.0384 -0.2592 -0.2904 -0.1026 0.3238 -0.2554 0.4242 0.4831 0.0372 -0.2316 -0.2833 0.0446 -0.2013 0.2812 -0.1281 0.4793 0.4791 -0.1862 0.2664 -0.2386 -0.1859 -0.1282 -0.1482 -0.1759 0.1167 0.1014 0.0953 0.0971 0.0900 0.1004 0.1061 0.0984 0.1560 0.1424 0.1366 0.1351 0.1479 0.1445 0.1604 0.1581 0.1465 0.1577 0.1574 0.1593 0.1588
va: 1.1471 1.1523 1.1515 1.1469 1.1516 1.1513 2.1148 2.0522 2.1118 2.0893 2.0611 3.1131 3.7662 3.8695 3.8124 3.9005 3.9101 3.8730 4.1452 3.9038 3.7279 4.0951 3.5919 4.0858 4.0508 3.8698 3.9903 3.7386 3.9087 4.4887 4.5183 3.9248 3.7105 4.0054 3.9141 3.8906 3.8922 3.8986 1.0105 1.0303 1.0021 1.0023 1.0045 1.0026 1.0001 1.0125 0.9826 1.0099 1.0177 1.0295 1.0453 1.0030 0.9907 0.9951 1.0070 0.9969 0.9897 0.9903 0.9902
dispcorr: -0.032680427 hartree
energy: -2033.620283807958
dipole: -65.19467 64.57649 -0.61818 -28.82925 28.66964 -0.15961 45.10584 -42.26393 2.84191
magnitude: 2.91274 au
magnitude: 7.40360 debye
