program: Orca
programVersion: 5.0.2
elementType: F F F F F F O O O O O N C C C C C C C C C C C C C C C C C C C C C C C C C C H H H H H H H H H H H H H H H H H H H H H
charge: 0
multiplicity: 1
keywords: wb97x-d3
keywords: def2-TZVPP
keywords: def2/J RIJCOSX
keywords: DEFGRID2
keywords: scfconv7
keywords: smallprint printgap noloewdin
keywords: NOSOSCF
formula: C26H21F6NO5
InChI: InChI=1/C26H21F6NO5/c1-24(2)18(11-12-20(34)38-23(25(27,28)29)26(30,31)32)21(24)22(35)37-19(14-33)15-7-6-10-17(13-15)36-16-8-4-3-5-9-16/h3-13,18-19,21,23H,1-2H3
59 atoms
F  5.225747 0.858569 1.261628
F  6.990409 1.927727 0.634423
F  5.830506 2.635453 2.305117
F  4.51421 4.878055 -0.997354
F  5.381641 5.047365 0.961516
F  6.572131 4.322353 -0.679918
O  -3.109053 -0.443273 -0.021007
O  -2.551598 1.282194 1.273705
O  3.611413 2.970845 0.717263
O  2.616611 2.116773 -1.104055
O  -4.432684 -5.21693 -1.372583
N  -2.556195 -1.816623 3.028147
C  -1.646617 2.458252 -1.536917
C  -0.394265 1.963205 -0.856246
C  -1.631259 1.069653 -0.944894
C  -1.600693 2.514049 -3.044753
C  -2.476005 3.563412 -0.932517
C  0.059935 2.546851 0.404234
C  -2.44418 0.699046 0.225818
C  1.31624 2.825018 0.784425
C  -3.960994 -0.929986 1.004845
C  2.523417 2.579699 0.001797
C  -4.791012 -2.057823 0.44565
C  -3.155553 -1.410776 2.13585
C  -4.170972 -3.120808 -0.203291
C  4.882022 2.871734 0.130665
C  -6.168181 -2.026574 0.602133
C  -4.950086 -4.161451 -0.687178
C  -6.934007 -3.073221 0.1061
C  5.750957 2.07327 1.100905
C  5.355943 4.299021 -0.139507
C  -6.332664 -4.141963 -0.532987
C  -3.166194 -5.672588 -1.114078
C  -2.362072 -5.960433 -2.205908
C  -2.721624 -5.910813 0.180436
C  -1.101963 -6.504179 -1.999571
C  -1.45426 -6.440753 0.371888
C  -0.641483 -6.742001 -0.712534
H  0.384678 1.63942 -1.53087
H  -1.536025 0.268216 -1.667952
H  -0.984707 1.718396 -3.464924
H  -1.187744 3.467615 -3.378343
H  -2.603764 2.418274 -3.46444
H  -2.056494 4.529713 -1.217251
H  -2.541593 3.543206 0.151732
H  -3.494045 3.519404 -1.322611
H  -0.700307 2.812706 1.125823
H  1.464594 3.278614 1.755804
H  -4.617391 -0.139076 1.379337
H  -3.094633 -3.133794 -0.327645
H  4.865125 2.333847 -0.824168
H  -6.642098 -1.194006 1.105874
H  -8.009228 -3.058006 0.224059
H  -6.926686 -4.962154 -0.916094
H  -2.72478 -5.770575 -3.208289
H  -3.353244 -5.693913 1.032529
H  -0.477521 -6.736407 -2.852097
H  -1.105854 -6.62702 1.379425
H  0.342606 -7.162921 -0.55453
elementType: F O N C H
totalener: -2033.59204849 hartree
nucrepener: 4053.50908807 hartree
electener: -6087.10113656 hartree
twoeener: 4766.71012844 hartree
cpcmener: -0.03876972 hartree
kineticenergy: 2025.76378613 hartree
xcener: -182.490180813067 hartree
chargesum: 0.0000000
charge: -0.165583 -0.164320 -0.163254 -0.166357 -0.163539 -0.163732 -0.284627 -0.442673 -0.279357 -0.430124 -0.325641 -0.088680 0.083336 -0.007767 -0.058456 -0.252717 -0.268416 -0.119183 0.398057 -0.307007 0.433542 0.490941 0.002543 -0.239635 -0.198138 0.045496 -0.189122 0.243066 -0.120938 0.478199 0.479558 -0.226465 0.282044 -0.245490 -0.195705 -0.121781 -0.139375 -0.182564 0.125655 0.105432 0.090749 0.097727 0.096852 0.104289 0.097350 0.102499 0.157289 0.140099 0.127461 0.147311 0.147122 0.145552 0.158842 0.148840 0.146452 0.157548 0.158098 0.160063 0.158634
qa: -0.1656 -0.1643 -0.1633 -0.1664 -0.1635 -0.1637 -0.2846 -0.4427 -0.2794 -0.4301 -0.3256 -0.0887 0.0833 -0.0078 -0.0585 -0.2527 -0.2684 -0.1192 0.3981 -0.3070 0.4335 0.4909 0.0025 -0.2396 -0.1981 0.0455 -0.1891 0.2431 -0.1209 0.4782 0.4796 -0.2265 0.2820 -0.2455 -0.1957 -0.1218 -0.1394 -0.1826 0.1257 0.1054 0.0907 0.0977 0.0969 0.1043 0.0973 0.1025 0.1573 0.1401 0.1275 0.1473 0.1471 0.1456 0.1588 0.1488 0.1465 0.1575 0.1581 0.1601 0.1586
va: 1.1465 1.1506 1.1509 1.1453 1.1505 1.1523 2.1685 2.0532 2.1116 2.0746 2.0853 3.1109 3.7789 3.7305 3.8868 3.9089 3.9034 3.8280 4.1101 3.9752 3.7292 4.1034 3.7400 4.0187 3.9463 3.8698 3.9440 3.7844 3.9159 4.5132 4.5038 3.9998 3.6865 4.0139 3.9240 3.8833 3.8881 3.9061 1.0309 1.0239 1.0061 1.0017 1.0019 0.9995 1.0129 0.9997 1.0029 1.0116 1.0241 1.0169 1.0460 1.0029 0.9899 1.0053 1.0076 0.9969 0.9892 0.9898 0.9903
dispcorr: -0.028406420 hartree
energy: -2033.620454909691
dipole: -74.41582 72.10052 -2.31531 -32.24627 32.39378 0.14750 -18.63215 16.64374 -1.98842
magnitude: 3.05552 au
magnitude: 7.76651 debye
