program: Orca
programVersion: 5.0.2
elementType: F F F F F F O O O O O N C C C C C C C C C C C C C C C C C C C C C C C C C C H H H H H H H H H H H H H H H H H H H H H
charge: 0
multiplicity: 1
keywords: wb97x-d3
keywords: def2-TZVPP
keywords: def2/J RIJCOSX
keywords: DEFGRID2
keywords: scfconv7
keywords: smallprint printgap noloewdin
keywords: NOSOSCF
formula: C26H21F6NO5
InChI: InChI=1/C26H21F6NO5/c1-24(2)18(11-12-20(34)38-23(25(27,28)29)26(30,31)32)21(24)22(35)37-19(14-33)15-7-6-10-17(13-15)36-16-8-4-3-5-9-16/h3-13,18-19,21,23H,1-2H3
59 atoms
F  2.485778 0.453215 -2.331625
F  4.588865 0.889506 -2.49007
F  3.851407 -0.297099 -0.85124
F  4.23744 3.606132 0.652203
F  5.023418 1.615371 0.825212
F  5.567702 2.843559 -0.85879
O  -3.283723 1.040531 -1.480537
O  -3.500792 0.971267 0.735405
O  2.347846 1.773459 0.120968
O  0.837009 2.954295 -1.043493
O  -1.92027 -4.068106 1.213126
N  -5.85685 -1.034858 -0.735914
C  -3.035124 4.030127 0.749161
C  -1.66405 3.517497 0.427309
C  -2.8887 3.026154 -0.363193
C  -3.330356 5.43605 0.27847
C  -3.725483 3.702674 2.05083
C  -0.939776 2.58777 1.304453
C  -3.2634 1.605957 -0.257544
C  0.290473 2.088983 1.122472
C  -3.458409 -0.364529 -1.535316
C  1.126548 2.344835 -0.048349
C  -2.345777 -1.129502 -0.84363
C  -4.796137 -0.731527 -1.055672
C  -2.60868 -2.28335 -0.122418
C  3.349355 2.030149 -0.828838
C  -1.0367 -0.678391 -0.982812
C  -1.565636 -2.978073 0.478039
C  -0.009799 -1.374035 -0.365129
C  3.582744 0.748913 -1.630535
C  4.568487 2.518454 -0.042419
C  -0.259364 -2.521786 0.372271
C  -1.054118 -5.116307 1.379567
C  -0.378955 -5.688788 0.308164
C  -0.929096 -5.638157 2.65858
C  0.434068 -6.79008 0.532915
C  -0.121562 -6.747769 2.866361
C  0.56657 -7.324593 1.808084
H  -1.040879 4.177629 -0.161215
H  -2.941515 3.416168 -1.372834
H  -2.834476 5.665838 -0.665658
H  -2.992312 6.16482 1.017251
H  -4.40286 5.578473 0.13471
H  -3.468026 4.461208 2.792107
H  -3.474499 2.734376 2.472341
H  -4.808228 3.728881 1.918786
H  -1.435045 2.282454 2.218754
H  0.707282 1.443079 1.884035
H  -3.44146 -0.5961 -2.603874
H  -3.618426 -2.657577 -0.002021
H  3.064939 2.821696 -1.532048
H  -0.809119 0.212765 -1.553806
H  1.007521 -1.017882 -0.449838
H  0.557731 -3.040387 0.85665
H  -0.486892 -5.288462 -0.692426
H  -1.466848 -5.183749 3.481576
H  0.961567 -7.236518 -0.300405
H  -0.028097 -7.157157 3.864062
H  1.19928 -8.186536 1.973871
elementType: F O N C H
totalener: -2033.58700518 hartree
nucrepener: 4352.27485576 hartree
electener: -6385.86186094 hartree
twoeener: 5065.29868480 hartree
cpcmener: -0.03974076 hartree
kineticenergy: 2025.74175626 hartree
xcener: -182.489497839788 hartree
chargesum: 0.0000000
charge: -0.168665 -0.162767 -0.168730 -0.165665 -0.163341 -0.162546 -0.288592 -0.427945 -0.275482 -0.431521 -0.322591 -0.078382 0.119408 -0.076328 -0.026784 -0.256849 -0.278995 -0.054878 0.359142 -0.318525 0.516405 0.506741 0.003344 -0.264871 -0.226728 0.033464 -0.321693 0.280072 -0.093721 0.499560 0.480232 -0.206399 0.278426 -0.193183 -0.240887 -0.141945 -0.124667 -0.180119 0.110326 0.098374 0.090281 0.097086 0.098510 0.099084 0.094817 0.104231 0.165070 0.139827 0.146820 0.120119 0.146104 0.145659 0.158135 0.152423 0.157699 0.146781 0.158797 0.157719 0.158142
qa: -0.1687 -0.1628 -0.1687 -0.1657 -0.1633 -0.1625 -0.2886 -0.4279 -0.2755 -0.4315 -0.3226 -0.0784 0.1194 -0.0763 -0.0268 -0.2568 -0.2790 -0.0549 0.3591 -0.3185 0.5164 0.5067 0.0033 -0.2649 -0.2267 0.0335 -0.3217 0.2801 -0.0937 0.4996 0.4802 -0.2064 0.2784 -0.1932 -0.2409 -0.1419 -0.1247 -0.1801 0.1103 0.0984 0.0903 0.0971 0.0985 0.0991 0.0948 0.1042 0.1651 0.1398 0.1468 0.1201 0.1461 0.1457 0.1581 0.1524 0.1577 0.1468 0.1588 0.1577 0.1581
va: 1.1405 1.1563 1.1402 1.1465 1.1509 1.1527 2.1299 2.0662 2.1165 2.0608 2.0843 3.1064 3.8131 3.7946 3.8781 3.8956 3.8908 3.7931 4.1116 3.9564 3.7835 4.0294 3.7534 4.1154 4.0481 3.9109 3.9729 3.7959 3.8334 4.4488 4.5151 3.9784 3.6923 3.9226 4.0093 3.8873 3.8853 3.9022 1.0275 1.0304 1.0045 1.0025 1.0020 1.0002 1.0193 0.9994 0.9847 1.0132 0.9879 1.0376 1.0430 1.0208 0.9958 1.0001 0.9962 1.0074 0.9902 0.9893 0.9904
dispcorr: -0.033596034 hartree
energy: -2033.620601217572
dipole: -52.06543 53.48451 1.41907 -6.61549 7.85907 1.24358 17.15734 -17.52021 -0.36286
magnitude: 1.92144 au
magnitude: 4.88391 debye
