program: Orca
programVersion: 5.0.2
elementType: F F F F F F O O O O O N C C C C C C C C C C C C C C C C C C C C C C C C C C H H H H H H H H H H H H H H H H H H H H H
charge: 0
multiplicity: 1
keywords: wb97x-d3
keywords: def2-TZVPP
keywords: def2/J RIJCOSX
keywords: DEFGRID2
keywords: scfconv7
keywords: smallprint printgap noloewdin
keywords: NOSOSCF
formula: C26H21F6NO5
InChI: InChI=1/C26H21F6NO5/c1-24(2)18(11-12-20(34)38-23(25(27,28)29)26(30,31)32)21(24)22(35)37-19(14-33)15-7-6-10-17(13-15)36-16-8-4-3-5-9-16/h3-13,18-19,21,23H,1-2H3
59 atoms
F  3.672144 -0.101762 -2.790128
F  3.058075 -1.328033 -1.128425
F  1.579421 -0.348578 -2.340887
F  4.045733 2.3716 0.558677
F  4.301013 0.247667 0.771379
F  5.161811 1.271082 -0.91848
O  -3.709479 1.183619 -0.149025
O  -3.549136 1.808886 -2.28636
O  1.781439 0.909679 0.043586
O  0.54042 2.452979 -1.01317
O  -0.286417 -2.274972 1.416164
N  -5.758807 -0.969137 1.305695
C  -3.108191 4.032459 0.675123
C  -1.774498 3.389641 0.476231
C  -2.826442 3.324686 -0.634562
C  -3.139648 5.540184 0.56289
C  -4.100159 3.510566 1.686074
C  -1.349649 2.192693 1.2229
C  -3.394332 2.053667 -1.116267
C  -0.239835 1.471721 1.020557
C  -4.125648 -0.12108 -0.547896
C  0.683285 1.70025 -0.087149
C  -2.924813 -1.019217 -0.697638
C  -5.035273 -0.584094 0.501408
C  -2.168307 -1.335485 0.421563
C  2.807477 1.03379 -0.906853
C  -2.533853 -1.449538 -1.958324
C  -0.998893 -2.067155 0.276827
C  -1.370087 -2.192897 -2.086682
C  2.787991 -0.208328 -1.798847
C  4.100512 1.222424 -0.114387
C  -0.591248 -2.499869 -0.980623
C  0.694351 -3.235006 1.448194
C  2.003686 -2.827947 1.644951
C  0.367732 -4.579895 1.340876
C  3.002263 -3.787717 1.744479
C  1.375881 -5.527835 1.43111
C  2.693661 -5.136159 1.632885
H  -0.962496 4.059107 0.215505
H  -2.616352 3.978483 -1.472764
H  -2.423063 5.911212 -0.171253
H  -2.897445 5.998408 1.523625
H  -4.130689 5.889038 0.267416
H  -3.942201 4.022529 2.637198
H  -4.042552 2.443776 1.881938
H  -5.119508 3.728987 1.364102
H  -1.96114 1.890996 2.066111
H  -0.007367 0.658095 1.694794
H  -4.698409 -0.08772 -1.479214
H  -2.466232 -1.006349 1.410955
H  2.673964 1.910588 -1.551252
H  -3.125763 -1.202227 -2.83001
H  -1.052462 -2.52993 -3.06462
H  0.321422 -3.066612 -1.110397
H  2.236679 -1.773677 1.727969
H  -0.66158 -4.884095 1.193862
H  4.026449 -3.475757 1.903282
H  1.127302 -6.578054 1.348262
H  3.475613 -5.880527 1.706386
elementType: F O N C H
totalener: -2033.58615381 hartree
nucrepener: 4592.75492193 hartree
electener: -6626.34107574 hartree
twoeener: 5305.80870108 hartree
cpcmener: -0.03817648 hartree
kineticenergy: 2025.76015177 hartree
xcener: -182.488913306952 hartree
chargesum: -0.0000000
charge: -0.163047 -0.164680 -0.164165 -0.165415 -0.161889 -0.163087 -0.266686 -0.439235 -0.281437 -0.428435 -0.324017 -0.085224 0.122588 -0.054452 -0.104661 -0.261749 -0.271950 -0.077330 0.411050 -0.286222 0.384584 0.504234 0.072229 -0.234950 -0.316314 0.029340 -0.184100 0.307336 -0.138638 0.495050 0.479030 -0.214748 0.245060 -0.221062 -0.162980 -0.144163 -0.152553 -0.157310 0.108759 0.097241 0.090035 0.096675 0.098577 0.101014 0.083558 0.106122 0.160632 0.141167 0.138426 0.133010 0.156408 0.145041 0.159075 0.147624 0.145819 0.156319 0.157168 0.158832 0.158494
qa: -0.1630 -0.1647 -0.1642 -0.1654 -0.1619 -0.1631 -0.2667 -0.4392 -0.2814 -0.4284 -0.3240 -0.0852 0.1226 -0.0545 -0.1047 -0.2617 -0.2720 -0.0773 0.4111 -0.2862 0.3846 0.5042 0.0722 -0.2350 -0.3163 0.0293 -0.1841 0.3073 -0.1386 0.4951 0.4790 -0.2147 0.2451 -0.2211 -0.1630 -0.1442 -0.1526 -0.1573 0.1088 0.0972 0.0900 0.0967 0.0986 0.1010 0.0836 0.1061 0.1606 0.1412 0.1384 0.1330 0.1564 0.1450 0.1591 0.1476 0.1458 0.1563 0.1572 0.1588 0.1585
va: 1.1544 1.1364 1.1447 1.1474 1.1454 1.1524 2.1255 2.0684 2.1098 2.0749 2.0555 3.1071 3.7817 3.7895 3.8878 3.9000 3.9004 3.8009 4.1618 3.9159 3.7757 4.0899 3.5689 4.0776 4.0648 3.8820 3.9641 3.6921 3.9220 4.4512 4.5125 3.8932 3.7159 3.9387 3.9444 3.9063 3.8979 3.8888 1.0233 1.0269 1.0050 1.0024 1.0018 1.0000 1.0131 1.0005 0.9857 1.0128 1.0188 1.0250 1.0460 1.0086 0.9906 1.0085 1.0112 0.9970 0.9917 0.9899 0.9896
dispcorr: -0.037710132 hartree
energy: -2033.623863944693
dipole: -44.78036 45.53144 0.75108 7.04892 -6.37773 0.67118 15.48672 -15.17547 0.31125
magnitude: 1.05427 au
magnitude: 2.67974 debye
