program: Orca
programVersion: 5.0.2
elementType: F F F F F F O O O O O N C C C C C C C C C C C C C C C C C C C C C C C C C C H H H H H H H H H H H H H H H H H H H H H
charge: 0
multiplicity: 1
keywords: wb97x-d3
keywords: def2-TZVPP
keywords: def2/J RIJCOSX
keywords: DEFGRID2
keywords: scfconv7
keywords: smallprint printgap noloewdin
keywords: NOSOSCF
formula: C26H21F6NO5
InChI: InChI=1/C26H21F6NO5/c1-24(2)18(11-12-20(34)38-23(25(27,28)29)26(30,31)32)21(24)22(35)37-19(14-33)15-7-6-10-17(13-15)36-16-8-4-3-5-9-16/h3-13,18-19,21,23H,1-2H3
59 atoms
F  5.630046 1.555071 1.921024
F  4.364719 0.316875 0.70688
F  6.317647 0.892376 -0.006572
F  4.834436 4.742514 -0.693403
F  5.695853 4.249665 1.210368
F  6.64597 3.579598 -0.603736
O  -0.928625 -0.921437 -0.258554
O  -0.914368 0.537851 1.432439
O  3.456524 2.860419 0.710282
O  2.111811 2.113645 -0.92531
O  -5.567773 -3.298102 0.023247
N  0.112261 -4.033595 -0.606744
C  -2.149575 2.443219 -0.726433
C  -0.698288 2.751403 -0.593987
C  -1.13327 1.312908 -0.824625
C  -2.814482 2.812698 -2.03051
C  -3.076253 2.551149 0.457879
C  -0.102934 3.182026 0.686692
C  -0.982303 0.321511 0.249717
C  1.195242 3.188671 1.005122
C  -0.880002 -1.988812 0.681651
C  2.24236 2.659266 0.137903
C  -2.251828 -2.311688 1.222945
C  -0.324998 -3.125952 -0.055712
C  -3.262014 -2.670083 0.337397
C  4.611583 2.523066 -0.009926
C  -2.500579 -2.221826 2.584314
C  -4.522933 -2.966122 0.83304
C  -3.772884 -2.503843 3.06305
C  5.250098 1.312281 0.668398
C  5.469962 3.785762 -0.016824
C  -4.783728 -2.882714 2.195822
C  -5.366844 -4.068111 -1.09171
C  -6.086396 -3.73022 -2.228913
C  -4.532676 -5.179793 -1.082555
C  -5.970523 -4.515269 -3.367467
C  -4.417101 -5.947138 -2.23265
C  -5.132395 -5.621711 -3.377674
H  -0.218223 3.177649 -1.469412
H  -0.959823 0.924418 -1.821083
H  -2.131534 2.730927 -2.87721
H  -3.175323 3.842661 -1.994319
H  -3.671612 2.166697 -2.22881
H  -3.456935 3.57175 0.530304
H  -2.619911 2.306712 1.413786
H  -3.934543 1.889836 0.327468
H  -0.778533 3.586436 1.432376
H  1.505287 3.590396 1.960996
H  -0.191492 -1.765356 1.501922
H  -3.064679 -2.72231 -0.727611
H  4.396381 2.248057 -1.049085
H  -1.710504 -1.934727 3.266244
H  -3.977983 -2.434764 4.123294
H  -5.774149 -3.112185 2.569145
H  -6.736038 -2.863446 -2.219279
H  -3.97936 -5.453949 -0.192735
H  -6.535545 -4.252253 -4.252607
H  -3.765434 -6.811653 -2.226596
H  -5.039262 -6.228289 -4.268923
elementType: F O N C H
totalener: -2033.58979971 hartree
nucrepener: 4194.07036049 hartree
electener: -6227.66016020 hartree
twoeener: 4907.73531663 hartree
cpcmener: -0.03842851 hartree
kineticenergy: 2025.78182156 hartree
xcener: -182.492218962928 hartree
chargesum: -0.0000000
charge: -0.163611 -0.164899 -0.163582 -0.166554 -0.163266 -0.163290 -0.287040 -0.445416 -0.280984 -0.430881 -0.327673 -0.087631 0.109177 -0.034549 -0.070057 -0.255467 -0.290762 -0.082821 0.377306 -0.274206 0.433050 0.492762 0.014651 -0.232970 -0.201137 0.046533 -0.196862 0.242914 -0.114606 0.478082 0.479941 -0.231509 0.285125 -0.251268 -0.191869 -0.119245 -0.140979 -0.185427 0.113650 0.100437 0.090291 0.095936 0.098273 0.105017 0.092860 0.102844 0.158003 0.141456 0.137493 0.147292 0.145220 0.145996 0.159074 0.148939 0.145879 0.155449 0.157843 0.159434 0.157635
qa: -0.1636 -0.1649 -0.1636 -0.1666 -0.1633 -0.1633 -0.2870 -0.4454 -0.2810 -0.4309 -0.3277 -0.0876 0.1092 -0.0345 -0.0701 -0.2555 -0.2908 -0.0828 0.3773 -0.2742 0.4330 0.4928 0.0147 -0.2330 -0.2011 0.0465 -0.1969 0.2429 -0.1146 0.4781 0.4799 -0.2315 0.2851 -0.2513 -0.1919 -0.1192 -0.1410 -0.1854 0.1136 0.1004 0.0903 0.0959 0.0983 0.1050 0.0929 0.1028 0.1580 0.1415 0.1375 0.1473 0.1452 0.1460 0.1591 0.1489 0.1459 0.1554 0.1578 0.1594 0.1576
va: 1.1511 1.1471 1.1516 1.1453 1.1503 1.1529 2.1390 2.0470 2.1162 2.0745 2.0820 3.1112 3.7854 3.8194 3.8729 3.8959 3.9059 3.8372 4.1299 3.9247 3.7286 4.0921 3.5907 4.0747 3.9524 3.8727 3.9578 3.7694 3.9038 4.5079 4.5177 4.0113 3.6917 4.0117 3.9065 3.8828 3.8903 3.9083 1.0202 1.0274 1.0046 1.0022 1.0022 0.9985 1.0162 1.0006 0.9812 1.0093 1.0186 1.0140 1.0448 1.0066 0.9893 1.0046 1.0081 0.9977 0.9890 0.9901 0.9906
dispcorr: -0.030503692 hartree
energy: -2033.620303398579
dipole: -83.41352 81.24910 -2.16443 -21.21148 22.72964 1.51816 -10.16036 10.28333 0.12296
magnitude: 2.64663 au
magnitude: 6.72720 debye
