program: Orca
programVersion: 5.0.2
elementType: F F F F F F O O O O O N C C C C C C C C C C C C C C C C C C C C C C C C C C H H H H H H H H H H H H H H H H H H H H H
charge: 0
multiplicity: 1
keywords: wb97x-d3
keywords: def2-TZVPP
keywords: def2/J RIJCOSX
keywords: DEFGRID2
keywords: scfconv7
keywords: smallprint printgap noloewdin
keywords: NOSOSCF
formula: C26H21F6NO5
InChI: InChI=1/C26H21F6NO5/c1-24(2)18(11-12-20(34)38-23(25(27,28)29)26(30,31)32)21(24)22(35)37-19(14-33)15-7-6-10-17(13-15)36-16-8-4-3-5-9-16/h3-13,18-19,21,23H,1-2H3
59 atoms
F  2.525436 0.60767 0.223563
F  4.658845 0.694381 -0.046546
F  3.775928 1.332717 1.812981
F  4.886408 3.855103 1.45577
F  5.762205 3.186129 -0.394258
F  4.39855 4.851978 -0.382218
O  -1.693331 0.299609 -0.036274
O  -2.134483 1.97458 1.36367
O  2.364027 3.358349 0.526749
O  1.018719 2.832115 -1.188578
O  -2.880914 -5.173464 0.630208
N  0.456203 0.194376 2.610817
C  -3.137364 3.526327 -1.118214
C  -1.677359 3.793659 -1.015342
C  -2.177443 2.352073 -1.004253
C  -3.756669 3.685086 -2.487479
C  -4.085676 3.883764 -0.001692
C  -1.051552 4.378244 0.189442
C  -2.022581 1.574601 0.232278
C  0.222948 4.238882 0.570743
C  -1.526647 -0.5654 1.078996
C  1.187467 3.409177 -0.147955
C  -1.255178 -1.949825 0.550514
C  -0.414913 -0.112577 1.927767
C  -2.181394 -2.951568 0.79047
C  3.460027 2.732869 -0.089439
C  -0.103776 -2.214776 -0.183298
C  -1.949793 -4.234627 0.308548
C  0.113492 -3.497463 -0.657055
C  3.616158 1.325626 0.491647
C  4.649255 3.661006 0.160305
C  -0.797672 -4.516198 -0.412838
C  -3.077516 -6.263225 -0.177781
C  -3.105064 -7.511328 0.425079
C  -3.309888 -6.123871 -1.540365
C  -3.374758 -8.633928 -0.345927
C  -3.564749 -7.255419 -2.300745
C  -3.59935 -8.512151 -1.709744
H  -1.171506 4.047991 -1.941309
H  -2.004255 1.788254 -1.912774
H  -3.060315 3.423637 -3.285349
H  -4.069945 4.71867 -2.646356
H  -4.637739 3.049702 -2.592453
H  -3.649199 3.842224 0.992249
H  -4.949929 3.217484 -0.01063
H  -4.454983 4.899524 -0.155073
H  -1.677187 5.003756 0.816952
H  0.56904 4.738565 1.465998
H  -2.427117 -0.572125 1.700468
H  -3.082356 -2.745261 1.356032
H  3.331234 2.635298 -1.174199
H  0.624274 -1.437046 -0.376042
H  1.011788 -3.717457 -1.218618
H  -0.596877 -5.514882 -0.778645
H  -2.925483 -7.601365 1.489162
H  -3.298399 -5.146059 -2.006216
H  -3.401709 -9.607929 0.125292
H  -3.744726 -7.149681 -3.362825
H  -3.80389 -9.389628 -2.308827
elementType: F O N C H
totalener: -2033.58880978 hartree
nucrepener: 4267.16352387 hartree
electener: -6300.75233365 hartree
twoeener: 4982.12295178 hartree
cpcmener: -0.04171549 hartree
kineticenergy: 2025.77218981 hartree
xcener: -182.490251785946 hartree
chargesum: -0.0000000
charge: -0.160224 -0.165642 -0.166266 -0.162507 -0.163784 -0.166464 -0.278029 -0.442591 -0.277276 -0.431682 -0.324722 -0.095631 0.116478 -0.027943 -0.078462 -0.259567 -0.288143 -0.091857 0.381552 -0.256374 0.447565 0.488237 0.008022 -0.252076 -0.210134 0.042493 -0.224481 0.253665 -0.153182 0.493006 0.478958 -0.169437 0.260903 -0.230912 -0.182295 -0.128338 -0.145918 -0.174594 0.112204 0.096869 0.089877 0.096502 0.098324 0.095252 0.102262 0.101279 0.153363 0.142112 0.125320 0.134828 0.143437 0.150774 0.159495 0.155700 0.146531 0.158347 0.157468 0.159046 0.158664
qa: -0.1602 -0.1656 -0.1663 -0.1625 -0.1638 -0.1665 -0.2780 -0.4426 -0.2773 -0.4317 -0.3247 -0.0956 0.1165 -0.0279 -0.0785 -0.2596 -0.2881 -0.0919 0.3816 -0.2564 0.4476 0.4882 0.0080 -0.2521 -0.2101 0.0425 -0.2245 0.2537 -0.1532 0.4930 0.4790 -0.1694 0.2609 -0.2309 -0.1823 -0.1283 -0.1459 -0.1746 0.1122 0.0969 0.0899 0.0965 0.0983 0.0953 0.1023 0.1013 0.1534 0.1421 0.1253 0.1348 0.1434 0.1508 0.1595 0.1557 0.1465 0.1583 0.1575 0.1590 0.1587
va: 1.1514 1.1504 1.1468 1.1518 1.1520 1.1451 2.1662 2.0377 2.1189 2.0717 2.0774 3.0998 3.7548 3.8287 3.8803 3.8996 3.8959 3.8617 4.0957 3.9168 3.7129 4.0745 3.7362 4.0077 4.0422 3.9008 3.9853 3.7926 3.9436 4.4584 4.5228 3.9035 3.7015 4.0055 3.9231 3.8871 3.8902 3.8973 1.0215 1.0286 1.0041 1.0022 1.0023 1.0164 1.0002 0.9986 0.9846 1.0092 1.0191 1.0175 1.0399 1.0185 0.9925 0.9969 1.0070 0.9955 0.9896 0.9903 0.9902
dispcorr: -0.031490421 hartree
energy: -2033.620300198341
dipole: -68.73781 66.37351 -2.36430 -24.48099 24.15108 -0.32991 -17.66268 15.14621 -2.51647
magnitude: 3.46863 au
magnitude: 8.81655 debye
