program: Orca
programVersion: 5.0.2
elementType: F F F F F F O O O O O N C C C C C C C C C C C C C C C C C C C C C C C C C C H H H H H H H H H H H H H H H H H H H H H
charge: 0
multiplicity: 1
keywords: wb97x-d3
keywords: def2-TZVPP
keywords: def2/J RIJCOSX
keywords: DEFGRID2
keywords: scfconv7
keywords: smallprint printgap noloewdin
keywords: NOSOSCF
formula: C26H21F6NO5
InChI: InChI=1/C26H21F6NO5/c1-24(2)18(11-12-20(34)38-23(25(27,28)29)26(30,31)32)21(24)22(35)37-19(14-33)15-7-6-10-17(13-15)36-16-8-4-3-5-9-16/h3-13,18-19,21,23H,1-2H3
59 atoms
F  3.116259 -0.409252 -1.319651
F  3.904102 0.243451 -3.218691
F  5.027852 0.560162 -1.408737
F  3.087682 4.203727 -2.058135
F  5.017002 3.262068 -1.970591
F  3.771686 2.997064 -3.707629
O  -1.004978 -0.111931 -0.324957
O  0.568135 -0.235214 1.266194
O  3.040546 2.108823 -0.349836
O  0.849414 2.589567 -0.421895
O  -3.710133 -4.169605 1.102802
N  0.428161 -0.305082 -3.302494
C  -1.410413 1.542266 2.905106
C  -0.477255 2.478842 2.220035
C  -1.172833 1.410278 1.404546
C  -2.770927 2.068689 3.290793
C  -0.882773 0.504109 3.863386
C  0.971101 2.500534 2.523339
C  -0.42051 0.288962 0.823382
C  1.999848 2.510218 1.672858
C  -0.445561 -1.218909 -1.016975
C  1.85064 2.423155 0.221053
C  -1.479763 -2.317028 -1.135318
C  0.028717 -0.714344 -2.306488
C  -2.129994 -2.70465 0.032039
C  3.077926 1.890203 -1.736562
C  -1.748639 -2.962893 -2.332471
C  -3.064221 -3.727536 -0.013468
C  -2.67262 -4.000142 -2.356608
C  3.801895 0.558401 -1.929863
C  3.76026 3.097853 -2.380647
C  -3.339769 -4.383644 -1.207083
C  -4.0414 -3.28012 2.092483
C  -3.716328 -3.615432 3.397674
C  -4.733913 -2.109427 1.808291
C  -4.097454 -2.770965 4.43203
C  -5.101269 -1.271375 2.85021
C  -4.785693 -1.596399 4.163806
H  -0.869034 3.474483 2.0222
H  -1.980719 1.764696 0.775919
H  -3.138828 2.812076 2.582361
H  -2.730699 2.539526 4.275082
H  -3.503094 1.260485 3.338724
H  -0.880826 0.911831 4.875999
H  0.129351 0.171592 3.646091
H  -1.529672 -0.375713 3.867025
H  1.219355 2.549146 3.579159
H  3.010053 2.537743 2.060662
H  0.429423 -1.604589 -0.484565
H  -1.904218 -2.223476 0.976226
H  2.077021 1.798474 -2.174975
H  -1.249832 -2.674676 -3.248846
H  -2.883899 -4.505157 -3.289795
H  -4.067896 -5.18458 -1.228686
H  -3.176935 -4.531796 3.602027
H  -4.991734 -1.855473 0.787446
H  -3.848545 -3.034122 5.451989
H  -5.645819 -0.361958 2.631471
H  -5.079393 -0.939886 4.972252
elementType: F O N C H
totalener: -2033.58706920 hartree
nucrepener: 4486.51679045 hartree
electener: -6520.10385965 hartree
twoeener: 5200.61715431 hartree
cpcmener: -0.03612846 hartree
kineticenergy: 2025.76028673 hartree
xcener: -182.491618019813 hartree
chargesum: -0.0000000
charge: -0.164770 -0.165368 -0.163751 -0.165577 -0.164027 -0.163515 -0.283220 -0.435162 -0.278788 -0.418407 -0.328202 -0.102602 0.100513 -0.026232 -0.028802 -0.254721 -0.274264 -0.114846 0.321532 -0.252058 0.503386 0.496399 -0.051270 -0.256455 -0.172031 0.036587 -0.202901 0.233109 -0.107066 0.493289 0.480762 -0.232936 0.258874 -0.234355 -0.168320 -0.114886 -0.155268 -0.190530 0.116449 0.101114 0.091514 0.098279 0.081919 0.103667 0.101228 0.086559 0.155620 0.142215 0.140389 0.154752 0.145064 0.137752 0.159306 0.147173 0.147186 0.156916 0.157000 0.162408 0.159365
qa: -0.1648 -0.1654 -0.1638 -0.1656 -0.1640 -0.1635 -0.2832 -0.4352 -0.2788 -0.4184 -0.3282 -0.1026 0.1005 -0.0262 -0.0288 -0.2547 -0.2743 -0.1148 0.3215 -0.2521 0.5034 0.4964 -0.0513 -0.2565 -0.1720 0.0366 -0.2029 0.2331 -0.1071 0.4933 0.4808 -0.2329 0.2589 -0.2344 -0.1683 -0.1149 -0.1553 -0.1905 0.1164 0.1011 0.0915 0.0983 0.0819 0.1037 0.1012 0.0866 0.1556 0.1422 0.1404 0.1548 0.1451 0.1378 0.1593 0.1472 0.1472 0.1569 0.1570 0.1624 0.1594
va: 1.1400 1.1496 1.1523 1.1466 1.1514 1.1525 2.1085 2.0517 2.1134 2.0838 2.0772 3.0888 3.7434 3.8800 3.7940 3.9020 3.9061 3.8797 4.1357 3.9147 3.6832 4.0676 3.8583 4.0355 3.8956 3.8860 3.9380 3.7550 3.9263 4.4855 4.5243 4.0147 3.7116 4.0078 3.9039 3.8567 3.8443 3.8657 1.0091 1.0321 1.0063 1.0021 1.0125 0.9999 1.0165 1.0048 0.9848 1.0105 1.0295 1.0041 1.0403 1.0161 0.9894 1.0057 1.0068 0.9964 0.9894 0.9883 0.9907
dispcorr: -0.036343809 hartree
energy: -2033.623413010853
dipole: -60.77471 58.74239 -2.03232 -17.39389 17.45371 0.05982 49.04451 -46.17254 2.87197
magnitude: 3.51882 au
magnitude: 8.94414 debye
