program: Orca
programVersion: 5.0.2
elementType: F F F F F F O O O O O N C C C C C C C C C C C C C C C C C C C C C C C C C C H H H H H H H H H H H H H H H H H H H H H
charge: 0
multiplicity: 1
keywords: wb97x-d3
keywords: def2-TZVPP
keywords: def2/J RIJCOSX
keywords: DEFGRID2
keywords: scfconv7
keywords: smallprint printgap noloewdin
keywords: NOSOSCF
formula: C26H21F6NO5
InChI: InChI=1/C26H21F6NO5/c1-24(2)18(11-12-20(34)38-23(25(27,28)29)26(30,31)32)21(24)22(35)37-19(14-33)15-7-6-10-17(13-15)36-16-8-4-3-5-9-16/h3-13,18-19,21,23H,1-2H3
59 atoms
F  3.262205 -0.543617 -1.153131
F  4.101227 0.039478 -3.052923
F  5.168335 0.439258 -1.225117
F  3.227186 4.0352 -2.069326
F  5.153132 3.118697 -1.812779
F  4.038095 2.781054 -3.62403
O  -0.988359 -0.183243 -0.317862
O  0.443151 -0.204418 1.406859
O  3.090637 2.003529 -0.295943
O  0.90813 2.47233 -0.528427
O  -3.934709 -4.034901 1.079675
N  0.617279 -0.525748 -3.177732
C  -1.590663 1.785543 2.707887
C  -0.576054 2.617167 2.004209
C  -1.25032 1.488784 1.251901
C  -2.956599 2.389292 2.927177
C  -1.171199 0.839987 3.804893
C  0.847433 2.619884 2.407126
C  -0.488645 0.302051 0.838817
C  1.93042 2.542252 1.62988
C  -0.379931 -1.325907 -0.897661
C  1.870852 2.353227 0.18134
C  -1.40318 -2.432691 -1.028801
C  0.174638 -0.890769 -2.1828
C  -2.193165 -2.703771 0.083567
C  3.216069 1.735783 -1.668597
C  -1.53585 -3.190081 -2.182613
C  -3.137074 -3.717072 0.021672
C  -2.466603 -4.221265 -2.217876
C  3.958232 0.404712 -1.780376
C  3.930895 2.926863 -2.305937
C  -3.275626 -4.486209 -1.127714
C  -4.294701 -3.059623 1.975177
C  -4.890805 -1.877954 1.5515
C  -4.093753 -3.311182 3.323302
C  -5.282871 -0.941912 2.49635
C  -4.499756 -2.369074 4.259645
C  -5.088115 -1.180644 3.851418
H  -0.911965 3.597141 1.671598
H  -1.996271 1.800332 0.531055
H  -3.239309 3.065125 2.118994
H  -2.976991 2.958954 3.858321
H  -3.720005 1.612113 2.995724
H  -1.239604 1.349315 4.768106
H  -0.153816 0.468975 3.706924
H  -1.83936 -0.022717 3.843752
H  1.027187 2.738331 3.471324
H  2.913027 2.57575 2.082574
H  0.457831 -1.674149 -0.284526
H  -2.072935 -2.134404 0.996942
H  2.244494 1.623069 -2.16399
H  -0.927714 -2.992784 -3.056012
H  -2.57211 -4.815122 -3.116029
H  -4.011081 -5.279978 -1.162984
H  -5.05365 -1.689006 0.497454
H  -3.628366 -4.237055 3.6376
H  -5.750873 -0.022639 2.168421
H  -4.346116 -2.5659 5.312846
H  -5.399091 -0.446689 4.583201
elementType: F O N C H
totalener: -2033.58701760 hartree
nucrepener: 4482.90621474 hartree
electener: -6516.49323234 hartree
twoeener: 5197.00501870 hartree
cpcmener: -0.03601394 hartree
kineticenergy: 2025.76354428 hartree
xcener: -182.492726338794 hartree
chargesum: -0.0000000
charge: -0.164712 -0.165706 -0.163278 -0.165837 -0.164029 -0.163318 -0.283322 -0.432690 -0.278413 -0.420931 -0.326948 -0.104499 0.101998 -0.022585 -0.026916 -0.255732 -0.274181 -0.112991 0.316269 -0.255224 0.501887 0.498517 -0.046327 -0.251451 -0.181733 0.036523 -0.210917 0.249689 -0.104009 0.493938 0.480231 -0.237574 0.262874 -0.175374 -0.232356 -0.150053 -0.114318 -0.193315 0.115563 0.098954 0.091701 0.098788 0.081771 0.102909 0.100725 0.087708 0.155296 0.142092 0.138387 0.152404 0.144370 0.137471 0.158581 0.146576 0.157242 0.147250 0.162389 0.157454 0.159184
qa: -0.1647 -0.1657 -0.1633 -0.1658 -0.1640 -0.1633 -0.2833 -0.4327 -0.2784 -0.4209 -0.3269 -0.1045 0.1020 -0.0226 -0.0269 -0.2557 -0.2742 -0.1130 0.3163 -0.2552 0.5019 0.4985 -0.0463 -0.2515 -0.1817 0.0365 -0.2109 0.2497 -0.1040 0.4939 0.4802 -0.2376 0.2629 -0.1754 -0.2324 -0.1501 -0.1143 -0.1933 0.1156 0.0990 0.0917 0.0988 0.0818 0.1029 0.1007 0.0877 0.1553 0.1421 0.1384 0.1524 0.1444 0.1375 0.1586 0.1466 0.1572 0.1472 0.1624 0.1575 0.1592
va: 1.1405 1.1489 1.1532 1.1462 1.1512 1.1530 2.1061 2.0558 2.1156 2.0818 2.0807 3.0849 3.7413 3.8782 3.7934 3.9021 3.9058 3.8780 4.1448 3.9137 3.6944 4.0668 3.8549 4.0245 3.8929 3.8878 3.9504 3.7510 3.9252 4.4847 4.5238 4.0155 3.7062 3.9129 4.0101 3.8380 3.8540 3.8655 1.0098 1.0326 1.0060 1.0023 1.0123 0.9996 1.0160 1.0049 0.9844 1.0105 1.0299 1.0074 1.0416 1.0159 0.9895 1.0062 0.9961 1.0064 0.9878 0.9891 0.9908
dispcorr: -0.036267714 hartree
energy: -2033.623285312853
dipole: -64.04819 61.92850 -2.11969 -13.30838 13.60999 0.30161 46.00545 -43.29798 2.70747
magnitude: 3.45173 au
magnitude: 8.77360 debye
