program: Orca
programVersion: 5.0.2
elementType: F F F F F F O O O O O N C C C C C C C C C C C C C C C C C C C C C C C C C C H H H H H H H H H H H H H H H H H H H H H
charge: 0
multiplicity: 1
keywords: wb97x-d3
keywords: def2-TZVPP
keywords: def2/J RIJCOSX
keywords: DEFGRID2
keywords: scfconv7
keywords: smallprint printgap noloewdin
keywords: NOSOSCF
formula: C26H21F6NO5
InChI: InChI=1/C26H21F6NO5/c1-24(2)18(11-12-20(34)38-23(25(27,28)29)26(30,31)32)21(24)22(35)37-19(14-33)15-7-6-10-17(13-15)36-16-8-4-3-5-9-16/h3-13,18-19,21,23H,1-2H3
59 atoms
F  2.091937 1.423742 2.869213
F  4.010529 0.509627 2.520114
F  3.869969 2.62336 2.905992
F  5.285055 1.204281 0.17393
F  4.108585 2.299651 -1.262781
F  4.917267 3.310238 0.448382
O  -2.053768 0.220446 -0.033429
O  -1.717082 2.12024 1.098357
O  2.238584 2.946793 0.674185
O  0.904256 1.912767 -0.809949
O  -2.884587 -4.733345 -1.216632
N  0.741619 -0.94937 1.37415
C  -2.995943 3.385557 -1.505909
C  -1.515111 3.514842 -1.607929
C  -2.110315 2.167025 -1.271196
C  -3.796997 3.355478 -2.784422
C  -3.727881 4.030774 -0.355979
C  -0.754815 4.368727 -0.668328
C  -1.934737 1.560645 0.055514
C  0.411959 4.135704 -0.062716
C  -1.834509 -0.545072 1.141789
C  1.158032 2.880392 -0.144468
C  -2.584798 -1.84561 1.013344
C  -0.388707 -0.769228 1.2763
C  -2.326374 -2.695511 -0.056658
C  3.085981 1.833882 0.792137
C  -3.552877 -2.166035 1.954519
C  -3.043943 -3.877486 -0.167929
C  -4.268437 -3.348137 1.823894
C  3.277761 1.598148 2.292431
C  4.374034 2.166143 0.037385
C  -4.01484 -4.208568 0.769986
C  -1.64079 -5.005477 -1.719097
C  -1.548668 -5.195555 -3.090807
C  -0.524634 -5.1561 -0.905117
C  -0.327617 -5.541209 -3.651087
C  0.692157 -5.491145 -1.481923
C  0.798389 -5.685547 -2.852469
H  -1.108238 3.550691 -2.616436
H  -2.102542 1.447325 -2.080953
H  -4.053867 4.369106 -3.09854
H  -4.729086 2.804044 -2.647355
H  -3.247066 2.884545 -3.600191
H  -4.035066 5.03968 -0.638106
H  -3.138852 4.11476 0.554785
H  -4.633018 3.470233 -0.115098
H  -1.187266 5.349346 -0.493511
H  0.838267 4.91127 0.560301
H  -2.171066 -0.013367 2.03604
H  -1.576243 -2.436329 -0.795115
H  2.653242 0.924418 0.358723
H  -3.751215 -1.496528 2.781534
H  -5.025718 -3.604446 2.552786
H  -4.567889 -5.133648 0.666613
H  -2.428365 -5.079999 -3.711557
H  -0.594276 -5.022676 0.167253
H  -0.258772 -5.691212 -4.720826
H  1.561475 -5.607981 -0.847801
H  1.750327 -5.949981 -3.293589
elementType: F O N C H
totalener: -2033.58821075 hartree
nucrepener: 4362.77168222 hartree
electener: -6396.35989297 hartree
twoeener: 5078.37861205 hartree
cpcmener: -0.03733270 hartree
kineticenergy: 2025.75650748 hartree
xcener: -182.487102893634 hartree
chargesum: -0.0000000
charge: -0.161370 -0.166556 -0.165113 -0.164197 -0.165950 -0.164117 -0.281916 -0.438953 -0.275536 -0.424814 -0.327024 -0.109889 0.094018 -0.021654 -0.055127 -0.258705 -0.285777 -0.112360 0.349261 -0.248528 0.453368 0.495610 0.017807 -0.226180 -0.212558 0.036178 -0.181744 0.237720 -0.118226 0.489573 0.478761 -0.226711 0.290384 -0.254399 -0.192625 -0.117117 -0.143323 -0.188571 0.118238 0.102159 0.094845 0.096287 0.089600 0.101712 0.097178 0.103789 0.155617 0.141168 0.120259 0.149896 0.144771 0.146927 0.159011 0.149361 0.145836 0.154696 0.157369 0.159465 0.158175
qa: -0.1614 -0.1666 -0.1651 -0.1642 -0.1659 -0.1641 -0.2819 -0.4390 -0.2755 -0.4248 -0.3270 -0.1099 0.0940 -0.0217 -0.0551 -0.2587 -0.2858 -0.1124 0.3493 -0.2485 0.4534 0.4956 0.0178 -0.2262 -0.2126 0.0362 -0.1817 0.2377 -0.1182 0.4896 0.4788 -0.2267 0.2904 -0.2544 -0.1926 -0.1171 -0.1433 -0.1886 0.1182 0.1022 0.0948 0.0963 0.0896 0.1017 0.0972 0.1038 0.1556 0.1412 0.1203 0.1499 0.1448 0.1469 0.1590 0.1494 0.1458 0.1547 0.1574 0.1595 0.1582
va: 1.1475 1.1476 1.1498 1.1524 1.1461 1.1507 2.1572 2.0526 2.1113 2.0763 2.0823 3.0758 3.7641 3.8486 3.8363 3.9036 3.9057 3.8714 4.1373 3.9069 3.7070 4.0787 3.7121 3.9962 3.9770 3.8824 3.9311 3.7730 3.9058 4.4958 4.5243 4.0129 3.6895 4.0094 3.9057 3.8830 3.8945 3.9095 1.0091 1.0269 1.0021 1.0021 1.0045 0.9994 1.0135 1.0002 0.9824 1.0099 1.0343 1.0135 1.0437 1.0008 0.9898 1.0046 1.0084 0.9983 0.9891 0.9903 0.9904
dispcorr: -0.032248322 hartree
energy: -2033.620459068418
dipole: -62.39674 59.44676 -2.94997 -12.71719 13.41240 0.69522 -25.07521 24.02128 -1.05392
magnitude: 3.20881 au
magnitude: 8.15613 debye
