program: Orca
programVersion: 5.0.2
elementType: F F F F F F O O O O O N C C C C C C C C C C C C C C C C C C C C C C C C C C H H H H H H H H H H H H H H H H H H H H H
charge: 0
multiplicity: 1
keywords: wb97x-d3
keywords: def2-TZVPP
keywords: def2/J RIJCOSX
keywords: DEFGRID2
keywords: scfconv7
keywords: smallprint printgap noloewdin
keywords: NOSOSCF
formula: C26H21F6NO5
InChI: InChI=1/C26H21F6NO5/c1-24(2)18(11-12-20(34)38-23(25(27,28)29)26(30,31)32)21(24)22(35)37-19(14-33)15-7-6-10-17(13-15)36-16-8-4-3-5-9-16/h3-13,18-19,21,23H,1-2H3
59 atoms
F  2.697165 -1.112928 0.661488
F  1.609722 -0.46186 -1.074428
F  3.765055 -0.465927 -1.090439
F  3.692135 2.913326 1.384343
F  3.866404 0.929912 2.191443
F  4.994338 1.481039 0.439811
O  -3.346145 1.238387 -0.189729
O  -2.874634 1.191738 -2.372983
O  1.503579 1.38487 0.932953
O  0.510396 2.572466 -0.690629
O  -0.127717 -3.174913 -1.402694
N  -5.688606 -0.408929 1.453891
C  -3.351706 4.256853 -0.3467
C  -1.970004 3.833485 0.014089
C  -2.637566 3.236963 -1.220035
C  -3.49334 5.619719 -0.984749
C  -4.538466 3.893515 0.510879
C  -1.666959 3.022838 1.21113
C  -2.957785 1.80495 -1.338881
C  -0.560487 2.303704 1.427299
C  -3.681617 -0.146324 -0.198881
C  0.490682 2.135231 0.428395
C  -2.500969 -0.989726 0.212857
C  -4.801014 -0.282744 0.736496
C  -1.842064 -1.74067 -0.747011
C  2.661461 1.218118 0.157609
C  -2.052088 -0.978209 1.530017
C  -0.724857 -2.491144 -0.390956
C  -0.940153 -1.728162 1.869682
C  2.694447 -0.229326 -0.334125
C  3.825197 1.627321 1.058087
C  -0.26815 -2.486199 0.920216
C  0.860826 -4.08995 -1.134906
C  0.580724 -5.254898 -0.43368
C  2.130326 -3.846381 -1.63521
C  1.595128 -6.176984 -0.222453
C  3.133573 -4.783748 -1.428607
C  2.873024 -5.945058 -0.715597
H  -1.176224 4.524728 -0.251659
H  -2.265278 3.621767 -2.161718
H  -3.590359 6.390465 -0.217844
H  -4.381638 5.664425 -1.61736
H  -2.63132 5.87454 -1.602747
H  -4.720567 4.696717 1.227466
H  -4.42679 2.975699 1.081032
H  -5.43601 3.793821 -0.101436
H  -2.389066 3.047537 2.020171
H  -0.429478 1.798142 2.374849
H  -4.047342 -0.456762 -1.181648
H  -2.188425 -1.749742 -1.773639
H  2.673459 1.869496 -0.724177
H  -2.562803 -0.395937 2.287021
H  -0.582281 -1.727965 2.890814
H  0.598017 -3.061037 1.217707
H  -0.417425 -5.442107 -0.057011
H  2.329244 -2.942604 -2.195996
H  1.38204 -7.084698 0.327264
H  4.124427 -4.597752 -1.822669
H  3.659215 -6.669989 -0.550353
elementType: F O N C H
totalener: -2033.58558531 hartree
nucrepener: 4583.41057285 hartree
electener: -6616.99615816 hartree
twoeener: 5296.92084894 hartree
cpcmener: -0.03955845 hartree
kineticenergy: 2025.77993468 hartree
xcener: -182.493572920500 hartree
chargesum: -0.0000000
charge: -0.174475 -0.175227 -0.170916 -0.166431 -0.163081 -0.163112 -0.257430 -0.443069 -0.282890 -0.429192 -0.317077 -0.087230 0.117809 -0.034761 -0.118570 -0.263226 -0.275926 -0.063651 0.416304 -0.295471 0.364911 0.512689 0.033334 -0.226459 -0.200155 0.060109 -0.240316 0.282615 -0.167616 0.506584 0.480334 -0.185862 0.269610 -0.192821 -0.226271 -0.139407 -0.130455 -0.169136 0.111004 0.096047 0.095491 0.098771 0.089695 0.101377 0.080334 0.106368 0.158601 0.138476 0.136797 0.129849 0.147291 0.146854 0.158163 0.147379 0.157262 0.141064 0.159158 0.157747 0.158203
qa: -0.1745 -0.1752 -0.1709 -0.1664 -0.1631 -0.1631 -0.2574 -0.4431 -0.2829 -0.4292 -0.3171 -0.0872 0.1178 -0.0348 -0.1186 -0.2632 -0.2759 -0.0637 0.4163 -0.2955 0.3649 0.5127 0.0333 -0.2265 -0.2002 0.0601 -0.2403 0.2826 -0.1676 0.5066 0.4803 -0.1859 0.2696 -0.1928 -0.2263 -0.1394 -0.1305 -0.1691 0.1110 0.0960 0.0955 0.0988 0.0897 0.1014 0.0803 0.1064 0.1586 0.1385 0.1368 0.1298 0.1473 0.1469 0.1582 0.1474 0.1573 0.1411 0.1592 0.1577 0.1582
va: 1.1365 1.1382 1.1491 1.1458 1.1512 1.1529 2.1160 2.0667 2.1133 2.0776 2.0720 3.1046 3.7561 3.8052 3.8715 3.9043 3.9060 3.8171 4.1533 3.9094 3.7727 4.0489 3.6114 4.0633 4.0616 3.9301 3.9451 3.6838 3.9485 4.3877 4.5210 3.8609 3.6807 3.9399 3.9839 3.8765 3.8980 3.9032 1.0209 1.0278 1.0024 1.0013 1.0052 1.0000 1.0112 1.0003 0.9831 1.0114 1.0221 1.0295 1.0445 1.0065 0.9919 1.0075 0.9965 1.0233 0.9898 0.9903 0.9901
dispcorr: -0.037435388 hartree
energy: -2033.623020693735
dipole: -44.31509 44.99956 0.68447 5.99148 -4.99787 0.99361 -3.02428 3.87151 0.84722
magnitude: 1.47429 au
magnitude: 3.74736 debye
